Add finger_edu robot

9 jobs for pr/91 in 1 minute and 57 seconds (queued for 2 seconds)
Name Stage Failure
failed
doc-coverage Test
------------------------------------------------------------------------------
File Lines Exec Cover Missing
------------------------------------------------------------------------------
------------------------------------------------------------------------------
TOTAL 0 0 --%
------------------------------------------------------------------------------
$ gcovr -e CMakeFiles -r . --html --html-details -o ${CI_PROJECT_DIR}/coverage/index.html
Cleaning up file based variables
ERROR: Job failed: exit code 1
failed
robotpkg-py-example-robot-data-py3-18.04-release Test
Total Test time (real) =  39.54 sec

The following tests FAILED:
1 - py-load (Failed)
Errors while running CTest
Makefile:109: recipe for target 'test' failed
make: *** [test] Error 8
Cleaning up file based variables
ERROR: Job failed: exit code 1
failed
robotpkg-py-example-robot-data-py3-buster-release Test

Total Test time (real) = 19.60 sec

The following tests FAILED:
1 - py-load (Failed)
Errors while running CTest
make: *** [Makefile:110: test] Error 8
Cleaning up file based variables
ERROR: Job failed: exit code 1
failed
robotpkg-py-example-robot-data-py2-18.04-release Test
Total Test time (real) =  20.53 sec

The following tests FAILED:
1 - py-load (Failed)
Errors while running CTest
make: *** [test] Error 8
Makefile:109: recipe for target 'test' failed
Cleaning up file based variables
ERROR: Job failed: exit code 1
failed
robotpkg-py-example-robot-data-py3-stretch-release Test
Total Test time (real) =  18.70 sec

The following tests FAILED:
1 - py-load (Failed)
Errors while running CTest
make: *** [test] Error 8
Makefile:74: recipe for target 'test' failed
Cleaning up file based variables
ERROR: Job failed: exit code 1
failed
format Test
$ test -f /builds/setup.cfg || ln -s /root/setup.cfg /builds
$ test -f /builds/.clang-format || ln -s /root/.clang-format /builds
$ check-clang-format.sh
error: cannot use -i when reading from stdin.
$ flake8 .
./python/example_robot_data/robots_loader.py:268:1: E302 expected 2 blank lines, found 1
./unittest/test_load.py:82:5: F811 redefinition of unused 'test_solo' from line 76
Cleaning up file based variables
ERROR: Job failed: exit code 1
failed
robotpkg-py-example-robot-data-py3-20.04-release Test

Total Test time (real) = 17.60 sec

The following tests FAILED:
1 - py-load (Failed)
Errors while running CTest
make: *** [Makefile:110: test] Error 8
Cleaning up file based variables
ERROR: Job failed: exit code 1
failed
robotpkg-py-example-robot-data-py3-ferrum-release Test
Total Test time (real) =  18.25 sec

The following tests FAILED:
1 - py-load (Failed)
Errors while running CTest
Makefile:128: recipe for target 'test' failed
make: *** [test] Error 8
Cleaning up file based variables
ERROR: Job failed: exit code 1