test: fix user_type for Windows

10 jobs for pr/261 in 16 minutes and 23 seconds (queued for 2 seconds)
Status Name Job ID Coverage
  Test
failed doc-coverage #128892

00:02:46

60.0%
failed format #128893
allowed to fail

00:00:26

failed robotpkg-py-eigenpy-16.04 #128895
allowed to fail

00:00:17

failed robotpkg-py-eigenpy-18.04 #128887
allowed to fail

00:13:58

failed robotpkg-py-eigenpy-20.04 #128888

00:16:23

failed robotpkg-py-eigenpy-buster #128889
allowed to fail

00:14:01

failed robotpkg-py-eigenpy-ferrum #128890
allowed to fail

00:05:19

failed robotpkg-py-eigenpy-stretch #128891
allowed to fail

00:06:11

failed robotpkg-py-eigenpy-16.04 #128894
allowed to fail

00:00:14

failed robotpkg-py-eigenpy-16.04 #128886
allowed to fail

00:00:10

 
Name Stage Failure
failed
robotpkg-py-eigenpy-20.04 Test
Total Test time (real) =   1.81 sec

The following tests FAILED:
7 - user_type (Child aborted)
13 - py-user-type (Failed)
Errors while running CTest
make: *** [Makefile:110: test] Error 8
Cleaning up file based variables
ERROR: Job failed: exit code 1
failed
robotpkg-py-eigenpy-buster Test
Total Test time (real) =   0.79 sec

The following tests FAILED:
7 - user_type (Child aborted)
13 - py-user-type (Failed)
Errors while running CTest
make: *** [Makefile:110: test] Error 8
Cleaning up file based variables
ERROR: Job failed: exit code 1
failed
robotpkg-py-eigenpy-18.04 Test

The following tests FAILED:
7 - user_type (Failed)
13 - py-user-type (Child aborted)
Errors while running CTest
Makefile:109: recipe for target 'test' failed
make: *** [test] Error 8
Cleaning up file based variables
ERROR: Job failed: exit code 1
failed
robotpkg-py-eigenpy-stretch Test
Total Test time (real) =   0.30 sec

The following tests FAILED:
7 - user_type (Failed)
13 - py-user-type (Failed)
Errors while running CTest
Makefile:85: recipe for target 'test' failed
make: *** [test] Error 8
Cleaning up file based variables
ERROR: Job failed: exit code 1
failed
robotpkg-py-eigenpy-ferrum Test

The following tests FAILED:
7 - user_type (Failed)
13 - py-user-type (Failed)
21 - py-MINRES (Failed)
Errors while running CTest
Makefile:128: recipe for target 'test' failed
make: *** [test] Error 8
Cleaning up file based variables
ERROR: Job failed: exit code 1
failed
doc-coverage Test
unittest/include.cpp                           1       1   100%   
unittest/matrix.cpp 67 67 100%
unittest/return_by_ref.cpp 21 19 90% 16,18
unittest/user_type.cpp 76 0 0% 61,63,72,74-75,78-81,83-86,90-91,93-96,98,100,102,105,107-109,112,114-115,124,127,131,133,137,140,144,151,153-156,158-161,163,166-168,171,175,177,180-182,184,187-189,191,193-194,197-208,210-211
------------------------------------------------------------------------------
TOTAL 1622 986 60%
------------------------------------------------------------------------------
$ gcovr -e CMakeFiles -r . --html --html-details -o ${CI_PROJECT_DIR}/coverage/index.html
Cleaning up file based variables
ERROR: Job failed: exit code 1
failed
robotpkg-py-eigenpy-16.04 Test There has been a runner system failure, please try again
Running with gitlab-runner 13.11.0 (7f7a4bb0)
on eur0c 5ns_aKV6
Preparing the "docker" executor
Using Docker executor with image memmos.laas.fr:5000/stack-of-tasks/eigenpy/py-eigenpy:16.04 ...
Pulling docker image memmos.laas.fr:5000/stack-of-tasks/eigenpy/py-eigenpy:16.04 ...
WARNING: Failed to pull image with policy "always": Error response from daemon: manifest for memmos.laas.fr:5000/stack-of-tasks/eigenpy/py-eigenpy:16.04 not found: manifest unknown: manifest unknown (manager.go:205:0s)
ERROR: Job failed (system failure): failed to pull image "memmos.laas.fr:5000/stack-of-tasks/eigenpy/py-eigenpy:16.04" with specified policies [always]: Error response from daemon: manifest for memmos.laas.fr:5000/stack-of-tasks/eigenpy/py-eigenpy:16.04 not found: manifest unknown: manifest unknown (manager.go:205:0s)
failed
format Test
./unittest/python/test_complex.py:22:15: F405 'ascomplex' may be undefined, or defined from star imports: complex
./unittest/python/test_complex.py:23:3: E111 indentation is not a multiple of 4
./unittest/python/test_complex.py:24:3: E111 indentation is not a multiple of 4
./unittest/python/test_complex.py:24:43: E231 missing whitespace after ','
./unittest/python/test_complex.py:27:1: E305 expected 2 blank lines after class or function definition, found 1
./benchmarks/bench-switch.py:6:1: F401 'time' imported but unused
./benchmarks/bench-switch.py:7:1: F401 'timeit' imported but unused
./benchmarks/bench-switch.py:53:24: E703 statement ends with a semicolon
Cleaning up file based variables
ERROR: Job failed: exit code 1