test: relax

8 jobs for pr/246 in 10 minutes and 21 seconds (queued for 2 seconds)
Status Name Job ID Coverage
  Test
failed doc-coverage #124840

00:10:19

74.0%
failed format #124841
allowed to fail

00:00:45

failed robotpkg-py-eigenpy-16.04 #124834
allowed to fail

00:06:04

failed robotpkg-py-eigenpy-18.04 #124835
allowed to fail

00:05:49

failed robotpkg-py-eigenpy-20.04 #124836

00:05:31

failed robotpkg-py-eigenpy-buster #124837
allowed to fail

00:05:13

failed robotpkg-py-eigenpy-ferrum #124838

00:06:39

failed robotpkg-py-eigenpy-stretch #124839
allowed to fail

00:00:52

 
Name Stage Failure
failed
robotpkg-py-eigenpy-buster Test

Total Test time (real) = 0.25 sec

The following tests FAILED:
21 - py-MINRES (Failed)
Errors while running CTest
make: *** [Makefile:110: test] Error 8
Cleaning up file based variables
ERROR: Job failed: exit code 1
failed
format Test
./unittest/python/test_self_adjoint_eigen_solver.py:5:1: F401 'numpy.linalg as la' imported but unused
./unittest/python/test_self_adjoint_eigen_solver.py:8:23: E231 missing whitespace after ','
./unittest/python/test_self_adjoint_eigen_solver.py:16:34: E231 missing whitespace after ','
./unittest/python/test_self_adjoint_eigen_solver.py:16:52: E231 missing whitespace after ','
./benchmarks/bench-switch.py:6:1: F401 'time' imported but unused
./benchmarks/bench-switch.py:7:1: F401 'timeit' imported but unused
./benchmarks/bench-switch.py:53:24: E703 statement ends with a semicolon
Cleaning up file based variables
ERROR: Job failed: exit code 1
failed
robotpkg-py-eigenpy-ferrum Test
Total Test time (real) =   0.30 sec

The following tests FAILED:
21 - py-MINRES (Failed)
Errors while running CTest
make: *** [test] Error 8
Makefile:128: recipe for target 'test' failed
Cleaning up file based variables
ERROR: Job failed: exit code 1
failed
robotpkg-py-eigenpy-18.04 Test
Total Test time (real) =   0.34 sec

The following tests FAILED:
21 - py-MINRES (Failed)
Errors while running CTest
Makefile:109: recipe for target 'test' failed
make: *** [test] Error 8
Cleaning up file based variables
ERROR: Job failed: exit code 1
failed
robotpkg-py-eigenpy-16.04 Test
Total Test time (real) =   0.32 sec

The following tests FAILED:
21 - py-MINRES (Failed)
Errors while running CTest
Makefile:85: recipe for target 'test' failed
make: *** [test] Error 8
Cleaning up file based variables
ERROR: Job failed: exit code 1
failed
doc-coverage Test
unittest/matrix.cpp                           67      67   100%   
unittest/return_by_ref.cpp 21 19 90% 16,18
unittest/user_type.cpp 75 56 74% 61,63,72,84-86,105,107-109,112,114-115,124,127,131,133,137,140
------------------------------------------------------------------------------
TOTAL 1626 1209 74%
------------------------------------------------------------------------------
$ gcovr -e CMakeFiles -r . --html --html-details -o ${CI_PROJECT_DIR}/coverage/index.html
Cleaning up file based variables
ERROR: Job failed: exit code 1
failed
robotpkg-py-eigenpy-20.04 Test

Total Test time (real) = 0.70 sec

The following tests FAILED:
21 - py-MINRES (Failed)
Errors while running CTest
make: *** [Makefile:110: test] Error 8
Cleaning up file based variables
ERROR: Job failed: exit code 1
failed
robotpkg-py-eigenpy-stretch Test
Total Test time (real) =   0.49 sec

The following tests FAILED:
21 - py-MINRES (Failed)
Errors while running CTest
make: *** [test] Error 8
Makefile:74: recipe for target 'test' failed
Cleaning up file based variables
ERROR: Job failed: exit code 1