test: add MINRES test

8 jobs for pr/246 in 1 minute and 20 seconds (queued for 3 seconds)
Status Name Job ID Coverage
  Test
failed doc-coverage #124824

00:01:17

0.0%
failed format #124825
allowed to fail

00:00:08

failed robotpkg-py-eigenpy-16.04 #124818
allowed to fail

00:00:37

failed robotpkg-py-eigenpy-18.04 #124819
allowed to fail

00:00:23

failed robotpkg-py-eigenpy-20.04 #124820

00:01:20

failed robotpkg-py-eigenpy-buster #124821
allowed to fail

00:00:28

failed robotpkg-py-eigenpy-ferrum #124822

00:00:26

failed robotpkg-py-eigenpy-stretch #124823
allowed to fail

00:00:26

 
Name Stage Failure
failed
robotpkg-py-eigenpy-stretch Test

For details or bug reports, check the complete log file in:
/root/robotpkg/math/py-eigenpy/work/build.log
/root/robotpkg/mk/build/build.mk:198: recipe for target 'do-build' failed
make: *** [do-build] Error 2
make: *** [install] Error 2
/root/robotpkg/mk/internal/trusted.mk:36: recipe for target 'install' failed
Cleaning up file based variables
ERROR: Job failed: exit code 1
failed
robotpkg-py-eigenpy-20.04 Test
| make[1]: Leaving directory '/root/robotpkg/math/py-eigenpy/work/eigenpy-2.6.4'
| make: *** [Makefile:144: all] Error 2
For details or bug reports, check the complete log file in:
/root/robotpkg/math/py-eigenpy/work/build.log

make: *** [/root/robotpkg/mk/build/build.mk:199: do-build] Error 2
make: *** [/root/robotpkg/mk/internal/trusted.mk:36: install] Error 2
Cleaning up file based variables
ERROR: Job failed: exit code 1
failed
doc-coverage Test
                                               4       0     0%   35,37,46,48
src/solvers/preconditioners.cpp 4 0 0% 27,31,35,40
src/solvers/solvers.cpp 4 0 0% 18,21,27,30
------------------------------------------------------------------------------
TOTAL 54 0 0%
------------------------------------------------------------------------------
$ gcovr -e CMakeFiles -r . --html --html-details -o ${CI_PROJECT_DIR}/coverage/index.html
Cleaning up file based variables
ERROR: Job failed: exit code 1
failed
robotpkg-py-eigenpy-16.04 Test
For details or bug reports, check the complete log file in:
/root/robotpkg/math/py-eigenpy/work/build.log

/root/robotpkg/mk/build/build.mk:198: recipe for target 'do-build' failed
make: *** [do-build] Error 2
/root/robotpkg/mk/internal/trusted.mk:36: recipe for target 'install' failed
make: *** [install] Error 2
Cleaning up file based variables
ERROR: Job failed: exit code 1
failed
robotpkg-py-eigenpy-buster Test
| make[1]: Leaving directory '/root/robotpkg/math/py-eigenpy/work/eigenpy-2.6.4'
| make: *** [Makefile:144: all] Error 2

For details or bug reports, check the complete log file in:
/root/robotpkg/math/py-eigenpy/work/build.log
make: *** [/root/robotpkg/mk/build/build.mk:199: do-build] Error 2
make: *** [/root/robotpkg/mk/internal/trusted.mk:36: install] Error 2
Cleaning up file based variables
ERROR: Job failed: exit code 1
failed
robotpkg-py-eigenpy-ferrum Test

For details or bug reports, check the complete log file in:
/root/robotpkg/math/py-eigenpy/work/build.log
make: *** [do-build] Error 2
/root/robotpkg/mk/build/build.mk:198: recipe for target 'do-build' failed
/root/robotpkg/mk/internal/trusted.mk:36: recipe for target 'install' failed
make: *** [install] Error 2
Cleaning up file based variables
ERROR: Job failed: exit code 1
failed
robotpkg-py-eigenpy-18.04 Test

For details or bug reports, check the complete log file in:
/root/robotpkg/math/py-eigenpy/work/build.log
/root/robotpkg/mk/build/build.mk:198: recipe for target 'do-build' failed
make: *** [do-build] Error 2
/root/robotpkg/mk/internal/trusted.mk:36: recipe for target 'install' failed
make: *** [install] Error 2
Cleaning up file based variables
ERROR: Job failed: exit code 1
failed
format Test
./benchmarks/bench-switch.py:6:1: F401 'time' imported but unused
./benchmarks/bench-switch.py:7:1: F401 'timeit' imported but unused
./benchmarks/bench-switch.py:53:24: E703 statement ends with a semicolon
./python/eigenpy/__init__.py:17:1: F403 'from .eigenpy import *' used; unable to detect undefined names
./python/eigenpy/__init__.py:17:1: F401 '.eigenpy.*' imported but unused
./python/eigenpy/__init__.py:18:1: F401 '.eigenpy.__version__' imported but unused
./python/eigenpy/__init__.py:18:1: F401 '.eigenpy.__raw_version__' imported but unused
Cleaning up file based variables
ERROR: Job failed: exit code 1