user-type.hpp: add doc for setitem and getitem + minor changes

10 jobs for pr/240 in 15 minutes and 27 seconds (queued for 1 second)
Status Name Job ID Coverage
  Test
failed doc-coverage #123152

00:11:58

73.0%
failed format #123154
allowed to fail

00:01:21

failed robotpkg-py-eigenpy-py2-18.04-release #123147
allowed to fail

00:08:21

failed robotpkg-py-eigenpy-py3-16.04-release #123145
allowed to fail

00:11:21

failed robotpkg-py-eigenpy-py3-18.04-release #123146
allowed to fail

00:05:09

failed robotpkg-py-eigenpy-py3-20.04-release #123148
allowed to fail

00:10:08

failed robotpkg-py-eigenpy-py3-buster-release #123149
allowed to fail

00:07:11

failed robotpkg-py-eigenpy-py3-ferrum-release #123150
allowed to fail

00:05:04

failed robotpkg-py-eigenpy-py3-stretch-release #123151
allowed to fail

00:15:25

failed format #123153
allowed to fail

00:00:09

 
Name Stage Failure
failed
robotpkg-py-eigenpy-py3-20.04-release Test

Total Test time (real) = 1.17 sec

The following tests FAILED:
13 - py-user-type (Failed)
Errors while running CTest
make: *** [Makefile:110: test] Error 8
Cleaning up file based variables
ERROR: Job failed: exit code 1
failed
robotpkg-py-eigenpy-py3-stretch-release Test
Total Test time (real) =   1.26 sec

The following tests FAILED:
13 - py-user-type (Failed)
Errors while running CTest
Makefile:74: recipe for target 'test' failed
make: *** [test] Error 8
Cleaning up file based variables
ERROR: Job failed: exit code 1
failed
robotpkg-py-eigenpy-py3-buster-release Test

Total Test time (real) = 0.60 sec

The following tests FAILED:
13 - py-user-type (Failed)
Errors while running CTest
make: *** [Makefile:110: test] Error 8
Cleaning up file based variables
ERROR: Job failed: exit code 1
failed
robotpkg-py-eigenpy-py2-18.04-release Test
Total Test time (real) =   0.45 sec

The following tests FAILED:
13 - py-user-type (Failed)
Errors while running CTest
Makefile:109: recipe for target 'test' failed
make: *** [test] Error 8
Cleaning up file based variables
ERROR: Job failed: exit code 1
failed
robotpkg-py-eigenpy-py3-ferrum-release Test
Total Test time (real) =   0.42 sec

The following tests FAILED:
13 - py-user-type (Failed)
Errors while running CTest
Makefile:128: recipe for target 'test' failed
make: *** [test] Error 8
Cleaning up file based variables
ERROR: Job failed: exit code 1
failed
doc-coverage Test
unittest/matrix.cpp                           67      67   100%   
unittest/return_by_ref.cpp 21 19 90% 16,18
unittest/user_type.cpp 63 36 57% 61,63,78-81,83-86,91,93-96,98,100,102-104,107,109-110,126,128,132,135
------------------------------------------------------------------------------
TOTAL 1494 1090 73%
------------------------------------------------------------------------------
$ gcovr -e CMakeFiles -r . --html --html-details -o ${CI_PROJECT_DIR}/coverage/index.html
Cleaning up file based variables
ERROR: Job failed: exit code 1
failed
robotpkg-py-eigenpy-py3-16.04-release Test

For details or bug reports, check the complete log file in:
/root/robotpkg/math/py-eigenpy/work/build.log
/root/robotpkg/mk/build/build.mk:198: recipe for target 'do-build' failed
make: *** [do-build] Error 2
/root/robotpkg/mk/internal/trusted.mk:36: recipe for target 'install' failed
make: *** [install] Error 2
Cleaning up file based variables
ERROR: Job failed: exit code 1
failed
robotpkg-py-eigenpy-py3-18.04-release Test
Total Test time (real) =   0.39 sec

The following tests FAILED:
13 - py-user-type (Failed)
Errors while running CTest
Makefile:109: recipe for target 'test' failed
make: *** [test] Error 8
Cleaning up file based variables
ERROR: Job failed: exit code 1
failed
format Test
./unittest/python/test_self_adjoint_eigen_solver.py:5:1: F401 'numpy.linalg as la' imported but unused
./unittest/python/test_self_adjoint_eigen_solver.py:8:23: E231 missing whitespace after ','
./unittest/python/test_self_adjoint_eigen_solver.py:16:34: E231 missing whitespace after ','
./unittest/python/test_self_adjoint_eigen_solver.py:16:52: E231 missing whitespace after ','
./benchmarks/bench-switch.py:6:1: F401 'time' imported but unused
./benchmarks/bench-switch.py:7:1: F401 'timeit' imported but unused
./benchmarks/bench-switch.py:53:24: E703 statement ends with a semicolon
Cleaning up file based variables
ERROR: Job failed: exit code 1