Format

8 jobs for master in 1 minute and 6 seconds (queued for 2 seconds)
Status Name Job ID Coverage
  Test
failed doc-coverage #66568

00:01:05

passed format #66569

00:01:05

failed robotpkg-py-sot-talos-16.04-debug #66563
allowed to fail

00:00:35

failed robotpkg-py-sot-talos-16.04-release #66562
allowed to fail

00:00:36

failed robotpkg-py-sot-talos-18.04-debug #66565
allowed to fail

00:00:30

failed robotpkg-py-sot-talos-18.04-release #66564
allowed to fail

00:00:30

failed robotpkg-py-sot-talos-stretch-debug #66567
allowed to fail

00:01:05

failed robotpkg-py-sot-talos-stretch-release #66566
allowed to fail

00:01:03

 
Name Stage Failure
failed
doc-coverage Test
make: *** [install] Error 2
Running after script...
$ cd /root/robotpkg/wip/py-sot-talos
$ build=$(make show-var VARNAME=CONFIGURE_DIRS); cd $(make show-var VARNAME=WRKSRC); cd $build
$ make doc
make: Nothing to be done for 'doc'.
$ mv doc/doxygen-html ${CI_PROJECT_DIR}
mv: cannot stat 'doc/doxygen-html': No such file or directory
ERROR: Job failed: exit code 1
failed
robotpkg-py-sot-talos-stretch-debug Test
ERROR: you can configure robotpkg.conf to use this version instead.
ERROR:
ERROR: See /root/robotpkg/wip/py-sot-talos/work.runner-7gqkM7SY-project-38-concurrent-1/sysdep.log for details.
ERROR: ======================================================================
make: *** [do-depends] Error 1
/root/robotpkg/mk/depends/depends.mk:70: recipe for target 'do-depends' failed
/root/robotpkg/mk/internal/trusted.mk:36: recipe for target 'install' failed
make: *** [install] Error 2
ERROR: Job failed: exit code 1
failed
robotpkg-py-sot-talos-stretch-release Test
ERROR:
=> Required system package urdfdom>=0.2.8: urdfdom-1.0.0 found
ERROR: See /root/robotpkg/wip/py-sot-talos/work.runner-7gqkM7SY-project-38-concurrent-0/sysdep.log for details.
ERROR: ======================================================================
make: *** [do-depends] Error 1
/root/robotpkg/mk/depends/depends.mk:70: recipe for target 'do-depends' failed
make: *** [install] Error 2
/root/robotpkg/mk/internal/trusted.mk:36: recipe for target 'install' failed
ERROR: Job failed: exit code 1
failed
robotpkg-py-sot-talos-16.04-debug Test
=> Required system package urdfdom>=0.2.8: urdfdom-0.4.0 found
ERROR:
ERROR: See /root/robotpkg/wip/py-sot-talos/work.runner-sWwLEjyc-project-38-concurrent-1/sysdep.log for details.
ERROR: ======================================================================
make: *** [do-depends] Error 1
/root/robotpkg/mk/depends/depends.mk:70: recipe for target 'do-depends' failed
/root/robotpkg/mk/internal/trusted.mk:36: recipe for target 'install' failed
make: *** [install] Error 2
ERROR: Job failed: exit code 1
failed
robotpkg-py-sot-talos-16.04-release Test
ERROR: you can configure robotpkg.conf to use this version instead.
ERROR:
ERROR: See /root/robotpkg/wip/py-sot-talos/work.runner-sWwLEjyc-project-38-concurrent-0/sysdep.log for details.
ERROR: ======================================================================
/root/robotpkg/mk/depends/depends.mk:70: recipe for target 'do-depends' failed
make: *** [do-depends] Error 1
/root/robotpkg/mk/internal/trusted.mk:36: recipe for target 'install' failed
make: *** [install] Error 2
ERROR: Job failed: exit code 1
failed
robotpkg-py-sot-talos-18.04-release Test
ERROR: you can configure robotpkg.conf to use this version instead.
ERROR:
ERROR: See /root/robotpkg/wip/py-sot-talos/work.runner-sWwLEjyc-project-38-concurrent-2/sysdep.log for details.
ERROR: ======================================================================
/root/robotpkg/mk/depends/depends.mk:70: recipe for target 'do-depends' failed
make: *** [do-depends] Error 1
make: *** [install] Error 2
/root/robotpkg/mk/internal/trusted.mk:36: recipe for target 'install' failed
ERROR: Job failed: exit code 1
failed
robotpkg-py-sot-talos-18.04-debug Test
ERROR: you can configure robotpkg.conf to use this version instead.
ERROR:
ERROR: See /root/robotpkg/wip/py-sot-talos/work.runner-sWwLEjyc-project-38-concurrent-3/sysdep.log for details.
ERROR: ======================================================================
make: *** [do-depends] Error 1
/root/robotpkg/mk/depends/depends.mk:70: recipe for target 'do-depends' failed
make: *** [install] Error 2
/root/robotpkg/mk/internal/trusted.mk:36: recipe for target 'install' failed
ERROR: Job failed: exit code 1