[CMake] sync submodule

6 jobs for master in 4 minutes and 26 seconds (queued for 5 seconds)
latest
Name Stage Failure
failed
doc-coverage Test
cmake/dynamic_graph/python-module-py.cc        5       0     0%   43,51,55,57,63
src/sot-hrp2-device.cpp 165 0 0% 32,34,39-44,46-47,49,52-58,61,68-70,76-77,79,82-83,85-86,90-91,93-96,100-102,104-110,113-116,118-120,123-124,126-130,133,135-138,141-144,146-149,152-153,155-158,161,163-166,171-172,175-179,182-183,185-189,192-193,195-200,203-204,206-211,214-215,217-222,225-226,228-233,239,241,244,246,249,251,254,257,260,264-265,267-269,272-273,275-284,286-287,290-291,294,297-300,302
src/sot-hrp2-device.hh 2 0 0% 40,42
------------------------------------------------------------------------------
TOTAL 172 0 0%
------------------------------------------------------------------------------
$ gcovr -e CMakeFiles -e _deps -r . --html --html-details -o ${CI_PROJECT_DIR}/coverage/index.html
Cleaning up project directory and file based variables
ERROR: Job failed: exit code 1

failed
robotpkg-sot-hrp2-v3-20.04 Test
| make[1]: Leaving directory '/root/robotpkg/wip/sot-hrp2-v3/work/sot-hrp2-v3-2.1.3'
| make: *** [Makefile:144: all] Error 2

For details or bug reports, check the complete log file in:
/root/robotpkg/wip/sot-hrp2-v3/work/build.log
make: *** [/root/robotpkg/mk/build/build.mk:199: do-build] Error 2
make: *** [/root/robotpkg/mk/internal/trusted.mk:36: install] Error 2
Cleaning up project directory and file based variables
ERROR: Job failed: exit code 1

failed
robotpkg-sot-hrp2-v3-ferrum Test

For details or bug reports, check the complete log file in:
/root/robotpkg/wip/sot-hrp2-v3/work/build.log
make: *** [do-build] Error 2
/root/robotpkg/mk/build/build.mk:198: recipe for target 'do-build' failed
make: *** [install] Error 2
/root/robotpkg/mk/internal/trusted.mk:36: recipe for target 'install' failed
Cleaning up project directory and file based variables
ERROR: Job failed: exit code 1

failed
robotpkg-sot-hrp2-v3-18.04 Test

For details or bug reports, check the complete log file in:
/root/robotpkg/wip/sot-hrp2-v3/work/build.log
/root/robotpkg/mk/build/build.mk:198: recipe for target 'do-build' failed
make: *** [do-build] Error 2
/root/robotpkg/mk/internal/trusted.mk:36: recipe for target 'install' failed
make: *** [install] Error 2
Cleaning up project directory and file based variables
ERROR: Job failed: exit code 1

failed
format Test
./src/dynamic_graph/sot/hrp2_10/prologue.py:18:1: E402 module level import not at top of file
./src/dynamic_graph/sot/hrp2_10/prologue.py:19:1: E402 module level import not at top of file
./src/dynamic_graph/sot/hrp2_10/prologue.py:29:19: E251 unexpected spaces around keyword / parameter equals
./src/dynamic_graph/sot/hrp2_10/prologue.py:29:21: E251 unexpected spaces around keyword / parameter equals
./src/dynamic_graph/sot/hrp2_10/prologue.py:29:37: E251 unexpected spaces around keyword / parameter equals
./src/dynamic_graph/sot/hrp2_10/prologue.py:29:39: E251 unexpected spaces around keyword / parameter equals
./src/dynamic_graph/sot/hrp2_10/prologue.py:31:28: E211 whitespace before '('
Cleaning up project directory and file based variables
ERROR: Job failed: exit code 1