Merge remote-tracking branch 'main/devel' into devel

9 jobs for v1.1.1 in 15 minutes and 10 seconds (queued for 1 second)
latest
Status Name Job ID Coverage
  Test
passed doc-coverage #66936

00:13:19

passed format #66978

00:02:41

failed robotpkg-eiquadprog-16.04-debug #66931
allowed to fail

00:11:17

failed robotpkg-eiquadprog-16.04-release #66930
allowed to fail

00:11:32

passed robotpkg-eiquadprog-18.04-debug #66933

00:13:08

passed robotpkg-eiquadprog-18.04-release #66932

00:13:18

passed robotpkg-eiquadprog-stretch-debug #66935

00:12:58

passed robotpkg-eiquadprog-stretch-release #66934

00:13:15

failed format #66937
allowed to fail

00:12:14

 
Name Stage Failure
failed
robotpkg-eiquadprog-16.04-release Test
| See also "/root/robotpkg/wip/eiquadprog/work.runner-7gqkM7SY-project-472-concurrent-12/eiquadprog-1.0.0/CMakeFiles/CMakeOutput.log".

For details or bug reports, check the complete log file in:
/root/robotpkg/wip/eiquadprog/work.runner-7gqkM7SY-project-472-concurrent-12/configure.log
/root/robotpkg/mk/configure/cmake-configure.mk:100: recipe for target 'do-configure-cmake' failed
make: *** [do-configure-cmake] Error 1
/root/robotpkg/mk/internal/trusted.mk:36: recipe for target 'install' failed
make: *** [install] Error 2
ERROR: Job failed: exit code 1
failed
robotpkg-eiquadprog-16.04-debug Test
| See also "/root/robotpkg/wip/eiquadprog/work.runner-7gqkM7SY-project-472-concurrent-13/eiquadprog-1.0.0/CMakeFiles/CMakeOutput.log".

For details or bug reports, check the complete log file in:
/root/robotpkg/wip/eiquadprog/work.runner-7gqkM7SY-project-472-concurrent-13/configure.log
/root/robotpkg/mk/configure/cmake-configure.mk:100: recipe for target 'do-configure-cmake' failed
make: *** [do-configure-cmake] Error 1
make: *** [install] Error 2
/root/robotpkg/mk/internal/trusted.mk:36: recipe for target 'install' failed
ERROR: Job failed: exit code 1