ros: update version

12 jobs for master in 39 minutes and 58 seconds (queued for 2 seconds)
Status Name Job ID Coverage
  Test
failed robotpkg-py-eigenpy-14.04-debug #65612

00:00:54

failed robotpkg-py-eigenpy-14.04-release #65611

00:02:41

failed robotpkg-py-eigenpy-16.04-debug #65615

00:02:11

failed robotpkg-py-eigenpy-16.04-release #65607

00:02:13

passed robotpkg-py-eigenpy-18.04-debug #65617

00:39:56

passed robotpkg-py-eigenpy-18.04-release #65608

00:22:12

failed robotpkg-py-eigenpy-py3-14.04-debug #65614

00:00:54

failed robotpkg-py-eigenpy-py3-14.04-release #65613

00:02:45

failed robotpkg-py-eigenpy-py3-16.04-debug #65616

00:00:38

failed robotpkg-py-eigenpy-py3-16.04-release #65609

00:02:10

passed robotpkg-py-eigenpy-py3-18.04-debug #65618

00:14:13

passed robotpkg-py-eigenpy-py3-18.04-release #65610

00:22:33

 
Name Stage Failure
failed
robotpkg-py-eigenpy-16.04-debug Test
| See also "/root/robotpkg/math/py-eigenpy/work.runner-7gqkM7SY-project-40-concurrent-6/eigenpy-2.0.2/CMakeFiles/CMakeOutput.log".

For details or bug reports, check the complete log file in:
/root/robotpkg/math/py-eigenpy/work.runner-7gqkM7SY-project-40-concurrent-6/configure.log
make: *** [do-configure-cmake] Error 1
/root/robotpkg/mk/configure/cmake-configure.mk:100: recipe for target 'do-configure-cmake' failed
/root/robotpkg/mk/internal/trusted.mk:36: recipe for target 'install' failed
make: *** [install] Error 2
ERROR: Job failed: exit code 1
failed
robotpkg-py-eigenpy-py3-14.04-debug Test
| 
| -- Configuring incomplete, errors occurred!
| See also "/root/robotpkg/math/py-eigenpy/work.runner-sWwLEjyc-project-40-concurrent-1/eigenpy-2.0.2/CMakeFiles/CMakeOutput.log".

For details or bug reports, check the complete log file in:
/root/robotpkg/math/py-eigenpy/work.runner-sWwLEjyc-project-40-concurrent-1/configure.log
make: *** [do-configure-cmake] Error 1
make: *** [install] Error 2
ERROR: Job failed: exit code 1
failed
robotpkg-py-eigenpy-py3-16.04-debug Test
| See also "/root/robotpkg/math/py-eigenpy/work.runner-sWwLEjyc-project-40-concurrent-2/eigenpy-2.0.2/CMakeFiles/CMakeOutput.log".

For details or bug reports, check the complete log file in:
/root/robotpkg/math/py-eigenpy/work.runner-sWwLEjyc-project-40-concurrent-2/configure.log
/root/robotpkg/mk/configure/cmake-configure.mk:100: recipe for target 'do-configure-cmake' failed
make: *** [do-configure-cmake] Error 1
/root/robotpkg/mk/internal/trusted.mk:36: recipe for target 'install' failed
make: *** [install] Error 2
ERROR: Job failed: exit code 1
failed
robotpkg-py-eigenpy-16.04-release Test
| See also "/root/robotpkg/math/py-eigenpy/work.runner-7gqkM7SY-project-40-concurrent-0/eigenpy-2.0.2/CMakeFiles/CMakeOutput.log".

For details or bug reports, check the complete log file in:
/root/robotpkg/math/py-eigenpy/work.runner-7gqkM7SY-project-40-concurrent-0/configure.log
/root/robotpkg/mk/configure/cmake-configure.mk:100: recipe for target 'do-configure-cmake' failed
make: *** [do-configure-cmake] Error 1
make: *** [install] Error 2
/root/robotpkg/mk/internal/trusted.mk:36: recipe for target 'install' failed
ERROR: Job failed: exit code 1
failed
robotpkg-py-eigenpy-py3-16.04-release Test
| See also "/root/robotpkg/math/py-eigenpy/work.runner-7gqkM7SY-project-40-concurrent-2/eigenpy-2.0.2/CMakeFiles/CMakeOutput.log".
For details or bug reports, check the complete log file in:
/root/robotpkg/math/py-eigenpy/work.runner-7gqkM7SY-project-40-concurrent-2/configure.log

/root/robotpkg/mk/configure/cmake-configure.mk:100: recipe for target 'do-configure-cmake' failed
make: *** [do-configure-cmake] Error 1
make: *** [install] Error 2
/root/robotpkg/mk/internal/trusted.mk:36: recipe for target 'install' failed
ERROR: Job failed: exit code 1
failed
robotpkg-py-eigenpy-py3-14.04-release Test
| 
| -- Configuring incomplete, errors occurred!
| See also "/root/robotpkg/math/py-eigenpy/work.runner-7gqkM7SY-project-40-concurrent-5/eigenpy-2.0.2/CMakeFiles/CMakeOutput.log".

For details or bug reports, check the complete log file in:
/root/robotpkg/math/py-eigenpy/work.runner-7gqkM7SY-project-40-concurrent-5/configure.log
make: *** [do-configure-cmake] Error 1
make: *** [install] Error 2
ERROR: Job failed: exit code 1
failed
robotpkg-py-eigenpy-14.04-release Test
| 
| -- Configuring incomplete, errors occurred!
| See also "/root/robotpkg/math/py-eigenpy/work.runner-7gqkM7SY-project-40-concurrent-4/eigenpy-2.0.2/CMakeFiles/CMakeOutput.log".

For details or bug reports, check the complete log file in:
/root/robotpkg/math/py-eigenpy/work.runner-7gqkM7SY-project-40-concurrent-4/configure.log
make: *** [do-configure-cmake] Error 1
make: *** [install] Error 2
ERROR: Job failed: exit code 1
failed
robotpkg-py-eigenpy-14.04-debug Test
| 
| -- Configuring incomplete, errors occurred!
| See also "/root/robotpkg/math/py-eigenpy/work.runner-sWwLEjyc-project-40-concurrent-0/eigenpy-2.0.2/CMakeFiles/CMakeOutput.log".
For details or bug reports, check the complete log file in:
/root/robotpkg/math/py-eigenpy/work.runner-sWwLEjyc-project-40-concurrent-0/configure.log

make: *** [do-configure-cmake] Error 1
make: *** [install] Error 2
ERROR: Job failed: exit code 1