user-type: add unit test for fill()

9 jobs for pr/240 in 10 minutes and 27 seconds (queued for 1 second)
Status Name Job ID Coverage
  Test
failed doc-coverage #123462

00:10:25

73.0%
failed format #123463
allowed to fail

00:00:26

failed robotpkg-py-eigenpy-py2-18.04-release #123457
allowed to fail

00:07:24

failed robotpkg-py-eigenpy-py3-16.04-release #123455
allowed to fail

00:06:18

failed robotpkg-py-eigenpy-py3-18.04-release #123456
allowed to fail

00:05:02

failed robotpkg-py-eigenpy-py3-20.04-release #123458
allowed to fail

00:07:34

failed robotpkg-py-eigenpy-py3-buster-release #123459
allowed to fail

00:05:08

failed robotpkg-py-eigenpy-py3-ferrum-release #123460
allowed to fail

00:06:53

failed robotpkg-py-eigenpy-py3-stretch-release #123461
allowed to fail

00:08:13

 
Name Stage Failure
failed
robotpkg-py-eigenpy-py3-18.04-release Test
Total Test time (real) =   0.42 sec

The following tests FAILED:
13 - py-user-type (Failed)
Errors while running CTest
Makefile:109: recipe for target 'test' failed
make: *** [test] Error 8
Cleaning up file based variables
ERROR: Job failed: exit code 1
failed
robotpkg-py-eigenpy-py3-stretch-release Test
Total Test time (real) =   0.43 sec

The following tests FAILED:
13 - py-user-type (Failed)
Errors while running CTest
Makefile:74: recipe for target 'test' failed
make: *** [test] Error 8
Cleaning up file based variables
ERROR: Job failed: exit code 1
failed
doc-coverage Test
unittest/matrix.cpp                           67      67   100%   
unittest/return_by_ref.cpp 21 19 90% 16,18
unittest/user_type.cpp 63 36 57% 61,63,78-81,83-86,91,93-96,98,100,102-104,107,109-110,126,128,132,135
------------------------------------------------------------------------------
TOTAL 1494 1090 73%
------------------------------------------------------------------------------
$ gcovr -e CMakeFiles -r . --html --html-details -o ${CI_PROJECT_DIR}/coverage/index.html
Cleaning up file based variables
ERROR: Job failed: exit code 1
failed
robotpkg-py-eigenpy-py3-20.04-release Test

Total Test time (real) = 0.63 sec

The following tests FAILED:
13 - py-user-type (Failed)
Errors while running CTest
make: *** [Makefile:110: test] Error 8
Cleaning up file based variables
ERROR: Job failed: exit code 1
failed
robotpkg-py-eigenpy-py2-18.04-release Test
Total Test time (real) =   0.26 sec

The following tests FAILED:
13 - py-user-type (Failed)
Errors while running CTest
Makefile:109: recipe for target 'test' failed
make: *** [test] Error 8
Cleaning up file based variables
ERROR: Job failed: exit code 1
failed
robotpkg-py-eigenpy-py3-ferrum-release Test
Total Test time (real) =   0.42 sec

The following tests FAILED:
13 - py-user-type (Failed)
Errors while running CTest
Makefile:128: recipe for target 'test' failed
make: *** [test] Error 8
Cleaning up file based variables
ERROR: Job failed: exit code 1
failed
robotpkg-py-eigenpy-py3-16.04-release Test

For details or bug reports, check the complete log file in:
/root/robotpkg/math/py-eigenpy/work/build.log
make: *** [do-build] Error 2
/root/robotpkg/mk/build/build.mk:198: recipe for target 'do-build' failed
make: *** [install] Error 2
/root/robotpkg/mk/internal/trusted.mk:36: recipe for target 'install' failed
Cleaning up file based variables
ERROR: Job failed: exit code 1
failed
robotpkg-py-eigenpy-py3-buster-release Test

Total Test time (real) = 0.37 sec

The following tests FAILED:
13 - py-user-type (Failed)
Errors while running CTest
make: *** [Makefile:110: test] Error 8
Cleaning up file based variables
ERROR: Job failed: exit code 1
failed
format Test
./benchmarks/bench-switch.py:6:1: F401 'time' imported but unused
./benchmarks/bench-switch.py:7:1: F401 'timeit' imported but unused
./benchmarks/bench-switch.py:53:24: E703 statement ends with a semicolon
./python/eigenpy/__init__.py:17:1: F403 'from .eigenpy import *' used; unable to detect undefined names
./python/eigenpy/__init__.py:17:1: F401 '.eigenpy.*' imported but unused
./python/eigenpy/__init__.py:18:1: F401 '.eigenpy.__version__' imported but unused
./python/eigenpy/__init__.py:18:1: F401 '.eigenpy.__raw_version__' imported but unused
Cleaning up file based variables
ERROR: Job failed: exit code 1