core: add fillwithscalar method

11 jobs for pr/240 in 13 minutes and 4 seconds (queued for 2 seconds)
Name Stage Failure
failed
doc-coverage Test
unittest/matrix.cpp                           67      67   100%   
unittest/return_by_ref.cpp 21 19 90% 16,18
unittest/user_type.cpp 63 36 57% 61,63,78-81,83-86,91,93-96,98,100,102-104,107,109-110,126,128,132,135
------------------------------------------------------------------------------
TOTAL 1499 1090 72%
------------------------------------------------------------------------------
$ gcovr -e CMakeFiles -r . --html --html-details -o ${CI_PROJECT_DIR}/coverage/index.html
Cleaning up file based variables
ERROR: Job failed: exit code 1
failed
format Test
./unittest/python/test_LDLT.py:14:19: W291 trailing whitespace
./unittest/python/test_LDLT.py:15:19: W291 trailing whitespace
./unittest/python/test_LDLT.py:16:27: W291 trailing whitespace
./unittest/python/test_LDLT.py:18:92: E231 missing whitespace after ','
./benchmarks/bench-switch.py:6:1: F401 'time' imported but unused
./benchmarks/bench-switch.py:7:1: F401 'timeit' imported but unused
./benchmarks/bench-switch.py:53:24: E703 statement ends with a semicolon
Cleaning up file based variables
ERROR: Job failed: exit code 1
failed
robotpkg-py-eigenpy-py3-buster-release Test

Total Test time (real) = 0.80 sec

The following tests FAILED:
13 - py-user-type (Failed)
Errors while running CTest
make: *** [Makefile:110: test] Error 8
Cleaning up file based variables
ERROR: Job failed: exit code 1
failed
robotpkg-py-eigenpy-py2-18.04-release Test
Total Test time (real) =   0.66 sec

The following tests FAILED:
13 - py-user-type (Failed)
Errors while running CTest
make: *** [test] Error 8
Makefile:109: recipe for target 'test' failed
Cleaning up file based variables
ERROR: Job failed: exit code 1
failed
robotpkg-py-eigenpy-py3-stretch-release Test
Total Test time (real) =   0.81 sec

The following tests FAILED:
13 - py-user-type (Failed)
Errors while running CTest
Makefile:74: recipe for target 'test' failed
make: *** [test] Error 8
Cleaning up file based variables
ERROR: Job failed: exit code 1
failed
robotpkg-py-eigenpy-py3-20.04-release Test

Total Test time (real) = 0.61 sec

The following tests FAILED:
13 - py-user-type (Failed)
Errors while running CTest
make: *** [Makefile:110: test] Error 8
Cleaning up file based variables
ERROR: Job failed: exit code 1
failed
robotpkg-py-eigenpy-py3-ferrum-release Test
Total Test time (real) =   0.57 sec

The following tests FAILED:
13 - py-user-type (Failed)
Errors while running CTest
Makefile:128: recipe for target 'test' failed
make: *** [test] Error 8
Cleaning up file based variables
ERROR: Job failed: exit code 1
failed
robotpkg-py-eigenpy-py3-18.04-release Test
Total Test time (real) =   0.94 sec

The following tests FAILED:
13 - py-user-type (Failed)
Errors while running CTest
Makefile:109: recipe for target 'test' failed
make: *** [test] Error 8
Cleaning up file based variables
ERROR: Job failed: exit code 1
failed
robotpkg-py-eigenpy-py3-16.04-release Test

For details or bug reports, check the complete log file in:
/root/robotpkg/math/py-eigenpy/work/build.log
/root/robotpkg/mk/build/build.mk:198: recipe for target 'do-build' failed
make: *** [do-build] Error 2
/root/robotpkg/mk/internal/trusted.mk:36: recipe for target 'install' failed
make: *** [install] Error 2
Cleaning up file based variables
ERROR: Job failed: exit code 1