Merge pull request #40 from nim65s/devel

fix #39
15 jobs for devel in 26 minutes and 21 seconds (queued for 3 seconds)
Status Name Job ID Coverage
  Test
failed doc-coverage #53778

00:10:20

failed format #53342
allowed to fail

00:12:56

failed robotpkg-py-dynamic-graph-v3-16.04-debug #53332

00:12:13

failed robotpkg-py-dynamic-graph-v3-16.04-release #53331

00:06:41

failed robotpkg-py-dynamic-graph-v3-18.04-debug #53334

00:12:08

failed robotpkg-py-dynamic-graph-v3-18.04-release #53335

00:12:37

failed robotpkg-py-dynamic-graph-v3-py3-16.04-debug #53330
allowed to fail

00:12:04

failed robotpkg-py-dynamic-graph-v3-py3-16.04-release #53329
allowed to fail

00:07:15

failed robotpkg-py-dynamic-graph-v3-py3-18.04-debug #53336
allowed to fail

00:12:58

failed robotpkg-py-dynamic-graph-v3-py3-18.04-release #53333
allowed to fail

00:12:13

failed robotpkg-py-dynamic-graph-v3-py3-stretch-debug #53340
allowed to fail

00:00:24

failed robotpkg-py-dynamic-graph-v3-py3-stretch-release #53337
allowed to fail

00:12:52

failed robotpkg-py-dynamic-graph-v3-stretch-debug #53339

00:12:53

failed robotpkg-py-dynamic-graph-v3-stretch-release #53338

00:15:58

failed doc-coverage #53341

00:12:57

 
Name Stage Failure
failed
doc-coverage Test
make: *** [install] Error 2
Running after script...
$ cd /root/robotpkg/wip/py-dynamic-graph-v3
$ build=$(make show-var VARNAME=CONFIGURE_DIRS); cd $(make show-var VARNAME=WRKSRC); cd $build
$ make doc
make: Nothing to be done for 'doc'.
$ mv doc/doxygen-html ${CI_PROJECT_DIR}
mv: cannot stat 'doc/doxygen-html': No such file or directory
ERROR: Job failed: exit code 1
failed
robotpkg-py-dynamic-graph-v3-stretch-release Test There has been a runner system failure, please try again
 * [new tag]         v3.3.2              -> v3.3.2
* [new tag] v3.4.0 -> v3.4.0
Checking out 0b7862d6 as devel...

Skipping Git submodules setup
Checking cache for default...
No URL provided, cache will not be downloaded from shared cache server. Instead a local version of cache will be extracted.
Successfully extracted cache
ERROR: Job failed (system failure): Cannot connect to the Docker daemon at unix:///var/run/docker.sock. Is the docker daemon running? (executor_docker.go:740:120s)
failed
robotpkg-py-dynamic-graph-v3-stretch-debug Test
For details or bug reports, check the complete log file in:
/root/robotpkg/wip/dynamic-graph-v3/work.runner-7gqkM7SY-project-167-concurrent-8/configure.log
/root/robotpkg/mk/configure/cmake-configure.mk:100: recipe for target 'do-configure-cmake' failed
make[1]: *** [do-configure-cmake] Error 1
/root/robotpkg/mk/depends/depends.mk:70: recipe for target 'do-depends' failed
make: *** [do-depends] Error 1
/root/robotpkg/mk/internal/trusted.mk:36: recipe for target 'install' failed
make: *** [install] Error 2
ERROR: Job failed: exit code 1
failed
robotpkg-py-dynamic-graph-v3-py3-18.04-debug Test
For details or bug reports, check the complete log file in:
/root/robotpkg/wip/dynamic-graph-v3/work.runner-7gqkM7SY-project-167-concurrent-5/configure.log
/root/robotpkg/mk/configure/cmake-configure.mk:100: recipe for target 'do-configure-cmake' failed
make[1]: *** [do-configure-cmake] Error 1
make: *** [do-depends] Error 1
/root/robotpkg/mk/depends/depends.mk:70: recipe for target 'do-depends' failed
/root/robotpkg/mk/internal/trusted.mk:36: recipe for target 'install' failed
make: *** [install] Error 2
ERROR: Job failed: exit code 1
failed
robotpkg-py-dynamic-graph-v3-py3-stretch-release Test
/root/robotpkg/wip/dynamic-graph-v3/work.runner-7gqkM7SY-project-167-concurrent-6/configure.log

make[1]: *** [do-configure-cmake] Error 1
/root/robotpkg/mk/configure/cmake-configure.mk:100: recipe for target 'do-configure-cmake' failed
/root/robotpkg/mk/depends/depends.mk:70: recipe for target 'do-depends' failed
make: *** [do-depends] Error 1
/root/robotpkg/mk/internal/trusted.mk:36: recipe for target 'install' failed
make: *** [install] Error 2
ERROR: Job failed: exit code 1
failed
robotpkg-py-dynamic-graph-v3-18.04-release Test
For details or bug reports, check the complete log file in:
/root/robotpkg/wip/dynamic-graph-v3/work.runner-7gqkM7SY-project-167-concurrent-4/configure.log
make[1]: *** [do-configure-cmake] Error 1
/root/robotpkg/mk/configure/cmake-configure.mk:100: recipe for target 'do-configure-cmake' failed
make: *** [do-depends] Error 1
/root/robotpkg/mk/depends/depends.mk:70: recipe for target 'do-depends' failed
/root/robotpkg/mk/internal/trusted.mk:36: recipe for target 'install' failed
make: *** [install] Error 2
ERROR: Job failed: exit code 1
failed
robotpkg-py-dynamic-graph-v3-16.04-debug Test
For details or bug reports, check the complete log file in:
/root/robotpkg/wip/dynamic-graph-v3/work.runner-7gqkM7SY-project-167-concurrent-1/configure.log
make[1]: *** [do-configure-cmake] Error 1
/root/robotpkg/mk/configure/cmake-configure.mk:100: recipe for target 'do-configure-cmake' failed
make: *** [do-depends] Error 1
/root/robotpkg/mk/depends/depends.mk:70: recipe for target 'do-depends' failed
make: *** [install] Error 2
/root/robotpkg/mk/internal/trusted.mk:36: recipe for target 'install' failed
ERROR: Job failed: exit code 1
failed
robotpkg-py-dynamic-graph-v3-18.04-debug Test There has been a runner system failure, please try again
 * [new tag]         v3.3.2              -> v3.3.2
* [new tag] v3.4.0 -> v3.4.0
Checking out 0b7862d6 as devel...

Skipping Git submodules setup
Checking cache for default...
No URL provided, cache will not be downloaded from shared cache server. Instead a local version of cache will be extracted.
Successfully extracted cache
ERROR: Job failed (system failure): Cannot connect to the Docker daemon at unix:///var/run/docker.sock. Is the docker daemon running? (executor_docker.go:740:120s)
failed
robotpkg-py-dynamic-graph-v3-py3-16.04-release Test
For details or bug reports, check the complete log file in:
/root/robotpkg/wip/dynamic-graph-v3/work.runner-tRjAffv3-project-167-concurrent-0/configure.log
/root/robotpkg/mk/configure/cmake-configure.mk:100: recipe for target 'do-configure-cmake' failed
make[1]: *** [do-configure-cmake] Error 1
/root/robotpkg/mk/depends/depends.mk:70: recipe for target 'do-depends' failed
make: *** [do-depends] Error 1
/root/robotpkg/mk/internal/trusted.mk:36: recipe for target 'install' failed
make: *** [install] Error 2
ERROR: Job failed: exit code 1
failed
robotpkg-py-dynamic-graph-v3-py3-18.04-release Test
For details or bug reports, check the complete log file in:
/root/robotpkg/wip/dynamic-graph-v3/work.runner-7gqkM7SY-project-167-concurrent-2/configure.log
make[1]: *** [do-configure-cmake] Error 1
/root/robotpkg/mk/configure/cmake-configure.mk:100: recipe for target 'do-configure-cmake' failed
make: *** [do-depends] Error 1
/root/robotpkg/mk/depends/depends.mk:70: recipe for target 'do-depends' failed
make: *** [install] Error 2
/root/robotpkg/mk/internal/trusted.mk:36: recipe for target 'install' failed
ERROR: Job failed: exit code 1
failed
robotpkg-py-dynamic-graph-v3-16.04-release Test
For details or bug reports, check the complete log file in:
/root/robotpkg/wip/dynamic-graph-v3/work.runner-tRjAffv3-project-167-concurrent-1/configure.log
/root/robotpkg/mk/configure/cmake-configure.mk:100: recipe for target 'do-configure-cmake' failed
make[1]: *** [do-configure-cmake] Error 1
make: *** [do-depends] Error 1
/root/robotpkg/mk/depends/depends.mk:70: recipe for target 'do-depends' failed
/root/robotpkg/mk/internal/trusted.mk:36: recipe for target 'install' failed
make: *** [install] Error 2
ERROR: Job failed: exit code 1
failed
robotpkg-py-dynamic-graph-v3-py3-16.04-debug Test
For details or bug reports, check the complete log file in:
/root/robotpkg/wip/dynamic-graph-v3/work.runner-7gqkM7SY-project-167-concurrent-0/configure.log
make[1]: *** [do-configure-cmake] Error 1
/root/robotpkg/mk/configure/cmake-configure.mk:100: recipe for target 'do-configure-cmake' failed
make: *** [do-depends] Error 1
/root/robotpkg/mk/depends/depends.mk:70: recipe for target 'do-depends' failed
make: *** [install] Error 2
/root/robotpkg/mk/internal/trusted.mk:36: recipe for target 'install' failed
ERROR: Job failed: exit code 1
failed
format Test
 
- void act() {
- m_sigdSIN.accessCopy();
- }
+ void act() { m_sigdSIN.accessCopy(); }
};
DYNAMICGRAPH_FACTORY_ENTITY_PLUGIN(CustomEntity, "CustomEntity");
} // namespace dynamicgraph
ERROR: Job failed: exit code 1
failed
robotpkg-py-dynamic-graph-v3-py3-stretch-debug Test
/root/robotpkg/wip/dynamic-graph-v3/work.runner-sWwLEjyc-project-167-concurrent-0/configure.log

make[1]: *** [do-configure-cmake] Error 1
/root/robotpkg/mk/configure/cmake-configure.mk:100: recipe for target 'do-configure-cmake' failed
make: *** [do-depends] Error 1
/root/robotpkg/mk/depends/depends.mk:70: recipe for target 'do-depends' failed
make: *** [install] Error 2
/root/robotpkg/mk/internal/trusted.mk:36: recipe for target 'install' failed
ERROR: Job failed: exit code 1