[CMake] detail

20 jobs for master in 27 minutes and 20 seconds (queued for 3 seconds)
Status Name Job ID Coverage
  Test
passed doc-coverage #52760

00:25:40

76.0%
failed format #52761
allowed to fail

00:02:01

passed robotpkg-hpp-fcl-16.04-debug #52743

00:05:54

passed robotpkg-hpp-fcl-16.04-release #52742

00:04:24

passed robotpkg-hpp-fcl-18.04-debug #52745

00:07:28

passed robotpkg-hpp-fcl-18.04-release #52744

00:14:04

passed robotpkg-hpp-fcl-stretch-debug #52747

00:15:09

passed robotpkg-hpp-fcl-stretch-release #52746

00:07:27

passed robotpkg-py-hpp-fcl-16.04-debug #52751

00:22:26

passed robotpkg-py-hpp-fcl-16.04-release #52749

00:10:49

passed robotpkg-py-hpp-fcl-18.04-debug #52755

00:22:56

passed robotpkg-py-hpp-fcl-18.04-release #52753

00:14:08

passed robotpkg-py-hpp-fcl-py3-16.04-debug #52748

00:22:27

passed robotpkg-py-hpp-fcl-py3-16.04-release #52750

00:08:38

passed robotpkg-py-hpp-fcl-py3-18.04-debug #52752

00:22:42

passed robotpkg-py-hpp-fcl-py3-18.04-release #52754

00:27:17

failed robotpkg-py-hpp-fcl-py3-stretch-debug #52756

00:12:12

failed robotpkg-py-hpp-fcl-py3-stretch-release #52759

00:11:33

failed robotpkg-py-hpp-fcl-stretch-debug #52757

00:22:46

failed robotpkg-py-hpp-fcl-stretch-release #52758

00:18:06

 
Name Stage Failure
failed
robotpkg-py-hpp-fcl-stretch-debug Test
| make: *** [all] Error 2
For details or bug reports, check the complete log file in:
/root/robotpkg/path/py-hpp-fcl/work.runner-7gqkM7SY-project-88-concurrent-5/build.log

/root/robotpkg/mk/build/build.mk:198: recipe for target 'do-build' failed
make: *** [do-build] Error 2
make: *** [install] Error 2
/root/robotpkg/mk/internal/trusted.mk:36: recipe for target 'install' failed
ERROR: Job failed: exit code 1
failed
robotpkg-py-hpp-fcl-stretch-release Test
| make: *** [all] Error 2

For details or bug reports, check the complete log file in:
/root/robotpkg/path/py-hpp-fcl/work.runner-tRjAffv3-project-88-concurrent-9/build.log
/root/robotpkg/mk/build/build.mk:198: recipe for target 'do-build' failed
make: *** [do-build] Error 2
make: *** [install] Error 2
/root/robotpkg/mk/internal/trusted.mk:36: recipe for target 'install' failed
ERROR: Job failed: exit code 1
failed
robotpkg-py-hpp-fcl-py3-stretch-debug Test
| make: *** [all] Error 2

For details or bug reports, check the complete log file in:
/root/robotpkg/path/py-hpp-fcl/work.runner-ULfN9w-c-project-88-concurrent-3/build.log
make: *** [do-build] Error 2
/root/robotpkg/mk/build/build.mk:198: recipe for target 'do-build' failed
/root/robotpkg/mk/internal/trusted.mk:36: recipe for target 'install' failed
make: *** [install] Error 2
ERROR: Job failed: exit code 1
failed
robotpkg-py-hpp-fcl-py3-stretch-release Test
| make: *** [all] Error 2

For details or bug reports, check the complete log file in:
/root/robotpkg/path/py-hpp-fcl/work.runner-ULfN9w-c-project-88-concurrent-4/build.log
/root/robotpkg/mk/build/build.mk:198: recipe for target 'do-build' failed
make: *** [do-build] Error 2
make: *** [install] Error 2
/root/robotpkg/mk/internal/trusted.mk:36: recipe for target 'install' failed
ERROR: Job failed: exit code 1
failed
format Test
 
-}
+} // namespace fcl

-} // namespace hpp
+} // namespace hpp

#endif
ERROR: Job failed: exit code 1