Update src/BVH/BV_fitter.cpp

Co-authored-by: Joseph Mirabel <josephmirabel@gmail.com>
12 jobs for pr/251 in 40 minutes and 40 seconds (queued for 3 seconds)
Status Name Job ID Coverage
  Test
passed doc-coverage #134954

00:40:37

77.0%
failed format #134955
allowed to fail

00:01:30

passed robotpkg-hpp-fcl-16.04 #134944

00:08:08

passed robotpkg-hpp-fcl-18.04 #134945

00:20:35

passed robotpkg-hpp-fcl-20.04 #134946

00:10:05

failed robotpkg-hpp-fcl-buster #134947
allowed to fail

00:08:38

passed robotpkg-hpp-fcl-ferrum #134948

00:13:46

passed robotpkg-py-hpp-fcl-16.04 #134949

00:13:42

passed robotpkg-py-hpp-fcl-18.04 #134950

00:17:33

passed robotpkg-py-hpp-fcl-20.04 #134951

00:20:07

failed robotpkg-py-hpp-fcl-buster #134952
allowed to fail

00:21:23

passed robotpkg-py-hpp-fcl-ferrum #134953

00:16:45

 
Name Stage Failure
failed
robotpkg-py-hpp-fcl-buster Test

Total Test time (real) = 100.25 sec

The following tests FAILED:
17 - gjk (Child aborted)
Errors while running CTest
make: *** [Makefile:110: test] Error 8
Cleaning up project directory and file based variables
ERROR: Job failed: exit code 1

failed
robotpkg-hpp-fcl-buster Test

Total Test time (real) = 54.50 sec

The following tests FAILED:
17 - gjk (Child aborted)
Errors while running CTest
make: *** [Makefile:110: test] Error 8
Cleaning up project directory and file based variables
ERROR: Job failed: exit code 1

failed
format Test
./python/hppfcl/viewer.py:55:95: E231 missing whitespace after ','
./python/hppfcl/viewer.py:55:97: E231 missing whitespace after ','
./python/hppfcl/viewer.py:55:120: E501 line too long (132 > 119 characters)
./python/hppfcl/viewer.py:58:1: E302 expected 2 blank lines, found 1
./python/hppfcl/viewer.py:77:21: E128 continuation line under-indented for visual indent
./python/hppfcl/viewer.py:77:65: E231 missing whitespace after ','
./python/hppfcl/viewer.py:77:67: E231 missing whitespace after ','
Cleaning up project directory and file based variables
ERROR: Job failed: exit code 1