Merge pull request #249 from jcarpent/devel

Remove warnings and add missing noalias
12 jobs for devel in 66 minutes and 4 seconds (queued for 8 seconds)
latest
Status Name Job ID Coverage
  Test
passed doc-coverage #134891

01:06:01

77.0%
failed format #134892
allowed to fail

00:00:08

passed robotpkg-hpp-fcl-16.04 #134881

00:05:33

passed robotpkg-hpp-fcl-18.04 #134882

00:16:32

passed robotpkg-hpp-fcl-20.04 #134883

00:18:45

failed robotpkg-hpp-fcl-buster #134884
allowed to fail

00:17:17

passed robotpkg-hpp-fcl-ferrum #134885

00:07:30

passed robotpkg-py-hpp-fcl-16.04 #134886

00:10:00

passed robotpkg-py-hpp-fcl-18.04 #134887

00:22:30

passed robotpkg-py-hpp-fcl-20.04 #134888

00:27:11

failed robotpkg-py-hpp-fcl-buster #134889
allowed to fail

00:24:39

passed robotpkg-py-hpp-fcl-ferrum #134890

00:13:18

 
Name Stage Failure
failed
robotpkg-py-hpp-fcl-buster Test
95% tests passed, 1 tests failed out of 21

Total Test time (real) = 50.83 sec

The following tests FAILED:
16 - gjk (Child aborted)
make: *** [Makefile:110: test] Error 8
Cleaning up project directory and file based variables
ERROR: Job failed: exit code 1

failed
robotpkg-hpp-fcl-buster Test
Total Test time (real) =  52.20 sec

The following tests FAILED:
16 - gjk (Child aborted)
18 - serialization (Child aborted)
Errors while running CTest
make: *** [Makefile:110: test] Error 8
Cleaning up project directory and file based variables
ERROR: Job failed: exit code 1

failed
format Test
./test/scripts/gjk.py:34:22: E211 whitespace before '('
./test/scripts/gjk.py:35:17: E211 whitespace before '('
./test/scripts/gjk.py:36:17: E211 whitespace before '('
./test/scripts/gjk.py:38:25: E211 whitespace before '('
./test/scripts/gjk.py:39:25: E211 whitespace before '('
./test/scripts/gjk.py:40:14: E211 whitespace before '('
./test/scripts/gjk.py:41:1: W391 blank line at end of file
Cleaning up project directory and file based variables
ERROR: Job failed: exit code 1