release: Update package.xml version to 1.7.7

12 jobs for master in 23 minutes and 34 seconds (queued for 5 seconds)
Status Name Job ID Coverage
  Test
passed doc-coverage #132541

00:23:33

77.0%
failed format #132542
allowed to fail

00:00:08

passed robotpkg-hpp-fcl-16.04 #132531

00:14:11

passed robotpkg-hpp-fcl-18.04 #132532

00:12:54

passed robotpkg-hpp-fcl-20.04 #132533

00:02:47

failed robotpkg-hpp-fcl-buster #132534
allowed to fail

00:10:13

passed robotpkg-hpp-fcl-ferrum #132535

00:06:24

passed robotpkg-py-hpp-fcl-16.04 #132536

00:16:33

passed robotpkg-py-hpp-fcl-18.04 #132537

00:02:26

passed robotpkg-py-hpp-fcl-20.04 #132538

00:05:52

failed robotpkg-py-hpp-fcl-buster #132539
allowed to fail

00:11:59

passed robotpkg-py-hpp-fcl-ferrum #132540

00:07:55

 
Name Stage Failure
failed
robotpkg-py-hpp-fcl-buster Test

Total Test time (real) = 64.02 sec

The following tests FAILED:
16 - gjk (Child aborted)
Errors while running CTest
make: *** [Makefile:110: test] Error 8
Cleaning up project directory and file based variables
ERROR: Job failed: exit code 1

failed
robotpkg-hpp-fcl-buster Test
Total Test time (real) =  42.97 sec

The following tests FAILED:
16 - gjk (Child aborted)
18 - serialization (Child aborted)
Errors while running CTest
make: *** [Makefile:110: test] Error 8
Cleaning up project directory and file based variables
ERROR: Job failed: exit code 1

failed
format Test
./python/hppfcl/viewer.py:77:21: E128 continuation line under-indented for visual indent
./python/hppfcl/viewer.py:77:65: E231 missing whitespace after ','
./python/hppfcl/viewer.py:77:67: E231 missing whitespace after ','
./python/hppfcl/__init__.py:34:1: F403 'from .hppfcl import *' used; unable to detect undefined names
./python/hppfcl/__init__.py:34:1: F401 '.hppfcl.*' imported but unused
./python/hppfcl/__init__.py:35:1: F401 '.hppfcl.__version__' imported but unused
./python/hppfcl/__init__.py:35:1: F401 '.hppfcl.__raw_version__' imported but unused
Cleaning up project directory and file based variables
ERROR: Job failed: exit code 1