Merge pull request #241 from jcarpent/devel

Bug fixes
12 jobs for devel in 23 minutes and 8 seconds (queued for 8 seconds)
Status Name Job ID Coverage
  Test
passed doc-coverage #129906

00:23:05

77.0%
failed format #129907
allowed to fail

00:00:07

passed robotpkg-hpp-fcl-16.04 #129896

00:02:06

passed robotpkg-hpp-fcl-18.04 #129897

00:01:58

passed robotpkg-hpp-fcl-20.04 #129898

00:01:47

failed robotpkg-hpp-fcl-buster #129899
allowed to fail

00:01:57

passed robotpkg-hpp-fcl-ferrum #129900

00:01:46

passed robotpkg-py-hpp-fcl-16.04 #129901

00:03:20

passed robotpkg-py-hpp-fcl-18.04 #129902

00:02:48

passed robotpkg-py-hpp-fcl-20.04 #129903

00:05:59

failed robotpkg-py-hpp-fcl-buster #129904
allowed to fail

00:02:24

passed robotpkg-py-hpp-fcl-ferrum #129905

00:04:07

 
Name Stage Failure
failed
robotpkg-py-hpp-fcl-buster Test
95% tests passed, 1 tests failed out of 21

Total Test time (real) = 47.61 sec

The following tests FAILED:
16 - gjk (Child aborted)
Errors while running CTest
make: *** [Makefile:110: test] Error 8
Cleaning up file based variables
ERROR: Job failed: exit code 1
failed
robotpkg-hpp-fcl-buster Test

Total Test time (real) = 57.97 sec

The following tests FAILED:
16 - gjk (Child aborted)
18 - serialization (Child aborted)
Errors while running CTest
make: *** [Makefile:110: test] Error 8
Cleaning up file based variables
ERROR: Job failed: exit code 1
failed
format Test
./test/scripts/geometric_shapes.py:46:38: E231 missing whitespace after ','
./test/scripts/geometric_shapes.py:46:40: E231 missing whitespace after ','
./test/scripts/geometric_shapes.py:46:42: E231 missing whitespace after ','
./test/scripts/geometric_shapes.py:46:45: E202 whitespace before ']'
./test/scripts/geometric_shapes.py:47:37: E231 missing whitespace after ','
./test/scripts/geometric_shapes.py:48:6: E201 whitespace after '('
./test/scripts/geometric_shapes.py:49:6: E201 whitespace after '('
./test/scripts/geometric_shapes.py:49:55: E202 whitespace before ']'
Cleaning up file based variables
ERROR: Job failed: exit code 1