python: export meshes vertices

12 jobs for pr/241 in 28 minutes and 16 seconds (queued for 6 seconds)
Status Name Job ID Coverage
  Test
passed doc-coverage #129894

00:28:13

77.0%
failed format #129895
allowed to fail

00:00:28

passed robotpkg-hpp-fcl-16.04 #129884

00:01:46

passed robotpkg-hpp-fcl-18.04 #129885

00:02:15

passed robotpkg-hpp-fcl-20.04 #129886

00:02:56

failed robotpkg-hpp-fcl-buster #129887
allowed to fail

00:01:35

passed robotpkg-hpp-fcl-ferrum #129888

00:01:37

passed robotpkg-py-hpp-fcl-16.04 #129889

00:05:30

passed robotpkg-py-hpp-fcl-18.04 #129890

00:03:09

passed robotpkg-py-hpp-fcl-20.04 #129891

00:02:38

failed robotpkg-py-hpp-fcl-buster #129892
allowed to fail

00:02:38

passed robotpkg-py-hpp-fcl-ferrum #129893

00:02:39

 
Name Stage Failure
failed
robotpkg-py-hpp-fcl-buster Test
95% tests passed, 1 tests failed out of 21

Total Test time (real) = 47.49 sec

The following tests FAILED:
16 - gjk (Child aborted)
Errors while running CTest
make: *** [Makefile:110: test] Error 8
Cleaning up file based variables
ERROR: Job failed: exit code 1
failed
robotpkg-hpp-fcl-buster Test

Total Test time (real) = 45.88 sec

The following tests FAILED:
Errors while running CTest
16 - gjk (Child aborted)
18 - serialization (Child aborted)
make: *** [Makefile:110: test] Error 8
Cleaning up file based variables
ERROR: Job failed: exit code 1
failed
format Test
./test/python_unit/collision.py:26:12: E225 missing whitespace around operator
./test/python_unit/collision.py:27:12: E225 missing whitespace around operator
./test/python_unit/collision.py:30:42: E231 missing whitespace after ','
./test/python_unit/collision.py:36:42: E231 missing whitespace after ','
./test/python_unit/collision.py:41:42: E231 missing whitespace after ','
./test/python_unit/collision.py:45:1: E305 expected 2 blank lines after class or function definition, found 1
./test/python_unit/test_case.py:4:1: E302 expected 2 blank lines, found 1
./test/python_unit/test_case.py:7:1: W391 blank line at end of file
Cleaning up file based variables
ERROR: Job failed: exit code 1