cmake: fix export of the project with Qhull

14 jobs for pr/241 in 7 minutes and 26 seconds (queued for 9 seconds)
Status Name Job ID Coverage
  Test
failed doc-coverage #129652

00:00:24

failed format #129653
allowed to fail

00:00:11

passed robotpkg-hpp-fcl-16.04 #129642

00:04:25

failed robotpkg-hpp-fcl-18.04 #129643

00:00:15

failed robotpkg-hpp-fcl-20.04 #129644

00:00:14

failed robotpkg-hpp-fcl-buster #129645
allowed to fail

00:00:19

failed robotpkg-hpp-fcl-ferrum #129654
allowed to fail

00:00:18

passed robotpkg-py-hpp-fcl-16.04 #129647

00:07:24

failed robotpkg-py-hpp-fcl-18.04 #129648

00:00:20

failed robotpkg-py-hpp-fcl-20.04 #129649

00:00:26

failed robotpkg-py-hpp-fcl-buster #129655
allowed to fail

00:00:17

failed robotpkg-py-hpp-fcl-ferrum #129651
allowed to fail

00:00:33

failed robotpkg-hpp-fcl-ferrum #129646
allowed to fail

00:00:10

failed robotpkg-py-hpp-fcl-buster #129650
allowed to fail

00:00:09

 
Name Stage Failure
failed
robotpkg-py-hpp-fcl-ferrum Test
For details or bug reports, check the complete log file in:
/root/robotpkg/path/hpp-fcl/work/configure.log
/root/robotpkg/mk/configure/cmake-configure.mk:100: recipe for target 'do-configure-cmake' failed
make[1]: *** [do-configure-cmake] Error 1
/root/robotpkg/mk/depends/depends.mk:70: recipe for target 'do-depends' failed
make: *** [do-depends] Error 1
/root/robotpkg/mk/internal/trusted.mk:36: recipe for target 'install' failed
make: *** [install] Error 2
Cleaning up file based variables
ERROR: Job failed: exit code 1
failed
robotpkg-hpp-fcl-ferrum Test
| 

For details or bug reports, check the complete log file in:
/root/robotpkg/path/hpp-fcl/work/configure.log
make: *** [do-configure-cmake] Error 1
/root/robotpkg/mk/configure/cmake-configure.mk:100: recipe for target 'do-configure-cmake' failed
make: *** [install] Error 2
/root/robotpkg/mk/internal/trusted.mk:36: recipe for target 'install' failed
Cleaning up file based variables
ERROR: Job failed: exit code 1
failed
robotpkg-py-hpp-fcl-buster Test
| -- Configuring incomplete, errors occurred!
| See also "/root/robotpkg/path/hpp-fcl/work/hpp-fcl-1.7.5/CMakeFiles/CMakeOutput.log".

For details or bug reports, check the complete log file in:
/root/robotpkg/path/hpp-fcl/work/configure.log
make[1]: *** [/root/robotpkg/mk/configure/cmake-configure.mk:100: do-configure-cmake] Error 1
make: *** [/root/robotpkg/mk/depends/depends.mk:70: do-depends] Error 1
make: *** [/root/robotpkg/mk/internal/trusted.mk:36: install] Error 2
Cleaning up file based variables
ERROR: Job failed: exit code 1
failed
robotpkg-py-hpp-fcl-20.04 Test
| -- Configuring incomplete, errors occurred!
| See also "/root/robotpkg/path/hpp-fcl/work/hpp-fcl-1.7.5/CMakeFiles/CMakeOutput.log".
For details or bug reports, check the complete log file in:
/root/robotpkg/path/hpp-fcl/work/configure.log

make[1]: *** [/root/robotpkg/mk/configure/cmake-configure.mk:100: do-configure-cmake] Error 1
make: *** [/root/robotpkg/mk/depends/depends.mk:70: do-depends] Error 1
make: *** [/root/robotpkg/mk/internal/trusted.mk:36: install] Error 2
Cleaning up file based variables
ERROR: Job failed: exit code 1
failed
doc-coverage Test
Running after_script
Running after script...
$ cd /root/robotpkg/path/py-hpp-fcl
$ build=$(make show-var VARNAME=CONFIGURE_DIRS); cd $(make show-var VARNAME=WRKSRC); cd $build
$ make doc
make: Nothing to be done for 'doc'.
$ mv doc/doxygen-html ${CI_PROJECT_DIR}
mv: cannot stat 'doc/doxygen-html': No such file or directory
Cleaning up file based variables
ERROR: Job failed: exit code 1
failed
robotpkg-py-hpp-fcl-18.04 Test
For details or bug reports, check the complete log file in:
/root/robotpkg/path/hpp-fcl/work/configure.log
make[1]: *** [do-configure-cmake] Error 1
/root/robotpkg/mk/configure/cmake-configure.mk:100: recipe for target 'do-configure-cmake' failed
make: *** [do-depends] Error 1
/root/robotpkg/mk/depends/depends.mk:70: recipe for target 'do-depends' failed
make: *** [install] Error 2
/root/robotpkg/mk/internal/trusted.mk:36: recipe for target 'install' failed
Cleaning up file based variables
ERROR: Job failed: exit code 1
failed
robotpkg-hpp-fcl-buster Test
| 
| -- Configuring incomplete, errors occurred!
| See also "/root/robotpkg/path/hpp-fcl/work/hpp-fcl-1.7.5/CMakeFiles/CMakeOutput.log".

For details or bug reports, check the complete log file in:
/root/robotpkg/path/hpp-fcl/work/configure.log
make: *** [/root/robotpkg/mk/configure/cmake-configure.mk:100: do-configure-cmake] Error 1
make: *** [/root/robotpkg/mk/internal/trusted.mk:36: install] Error 2
Cleaning up file based variables
ERROR: Job failed: exit code 1
failed
robotpkg-hpp-fcl-18.04 Test
| See also "/root/robotpkg/path/hpp-fcl/work/hpp-fcl-1.7.5/CMakeFiles/CMakeOutput.log".
For details or bug reports, check the complete log file in:
/root/robotpkg/path/hpp-fcl/work/configure.log

make: *** [do-configure-cmake] Error 1
/root/robotpkg/mk/configure/cmake-configure.mk:100: recipe for target 'do-configure-cmake' failed
/root/robotpkg/mk/internal/trusted.mk:36: recipe for target 'install' failed
make: *** [install] Error 2
Cleaning up file based variables
ERROR: Job failed: exit code 1
failed
robotpkg-hpp-fcl-20.04 Test
| 
| -- Configuring incomplete, errors occurred!
| See also "/root/robotpkg/path/hpp-fcl/work/hpp-fcl-1.7.5/CMakeFiles/CMakeOutput.log".

For details or bug reports, check the complete log file in:
/root/robotpkg/path/hpp-fcl/work/configure.log
make: *** [/root/robotpkg/mk/configure/cmake-configure.mk:100: do-configure-cmake] Error 1
make: *** [/root/robotpkg/mk/internal/trusted.mk:36: install] Error 2
Cleaning up file based variables
ERROR: Job failed: exit code 1
failed
format Test
./doc/python/xml_docstring.py:143:19: E211 whitespace before '('
./doc/python/xml_docstring.py:147:23: E211 whitespace before '('
./doc/python/xml_docstring.py:149:17: E211 whitespace before '('
./doc/python/xml_docstring.py:150:20: E211 whitespace before '('
./doc/python/xml_docstring.py:151:23: E211 whitespace before '('
./doc/python/xml_docstring.py:153:16: E211 whitespace before '('
./doc/python/xml_docstring.py:156:28: E211 whitespace before '('
./doc/python/xml_docstring.py:158:28: E211 whitespace before '('
Cleaning up file based variables
ERROR: Job failed: exit code 1