cmake: enforce c++ 11

12 jobs for pr/241 in 38 minutes and 17 seconds (queued for 4 seconds)
Status Name Job ID Coverage
  Test
passed doc-coverage #129607

00:38:14

77.0%
failed format #129608
allowed to fail

00:00:27

passed robotpkg-hpp-fcl-16.04 #129597

00:03:50

passed robotpkg-hpp-fcl-18.04 #129598

00:02:05

passed robotpkg-hpp-fcl-20.04 #129599

00:03:24

failed robotpkg-hpp-fcl-buster #129600
allowed to fail

00:02:05

passed robotpkg-hpp-fcl-ferrum #129601

00:06:22

passed robotpkg-py-hpp-fcl-16.04 #129602

00:05:35

passed robotpkg-py-hpp-fcl-18.04 #129603

00:02:56

passed robotpkg-py-hpp-fcl-20.04 #129604

00:04:59

failed robotpkg-py-hpp-fcl-buster #129605
allowed to fail

00:09:40

passed robotpkg-py-hpp-fcl-ferrum #129606

00:06:00

 
Name Stage Failure
failed
robotpkg-py-hpp-fcl-buster Test

Total Test time (real) = 98.02 sec

The following tests FAILED:
16 - gjk (Child aborted)
Errors while running CTest
make: *** [Makefile:110: test] Error 8
Cleaning up file based variables
ERROR: Job failed: exit code 1
failed
robotpkg-hpp-fcl-buster Test
89% tests passed, 2 tests failed out of 18

Total Test time (real) = 56.40 sec

The following tests FAILED:
16 - gjk (Child aborted)
18 - serialization (Child aborted)
make: *** [Makefile:110: test] Error 8
Cleaning up file based variables
ERROR: Job failed: exit code 1
failed
format Test
./python/hppfcl/viewer.py:58:1: E302 expected 2 blank lines, found 1
./python/hppfcl/viewer.py:77:21: E128 continuation line under-indented for visual indent
./python/hppfcl/viewer.py:77:65: E231 missing whitespace after ','
./python/hppfcl/viewer.py:77:67: E231 missing whitespace after ','
./python/hppfcl/__init__.py:34:1: F403 'from .hppfcl import *' used; unable to detect undefined names
./python/hppfcl/__init__.py:34:1: F401 '.hppfcl.*' imported but unused
./python/hppfcl/__init__.py:35:1: F401 '.hppfcl.__version__' imported but unused
./python/hppfcl/__init__.py:35:1: F401 '.hppfcl.__raw_version__' imported but unused
Cleaning up file based variables
ERROR: Job failed: exit code 1