release: Update package.xml version to 1.7.6

12 jobs for master in 23 minutes and 4 seconds (queued for 4 seconds)
Status Name Job ID Coverage
  Test
passed doc-coverage #129522

00:23:02

77.0%
failed format #129523
allowed to fail

00:00:09

passed robotpkg-hpp-fcl-16.04 #129512

00:03:19

passed robotpkg-hpp-fcl-18.04 #129513

00:02:48

passed robotpkg-hpp-fcl-20.04 #129514

00:04:22

failed robotpkg-hpp-fcl-buster #129515
allowed to fail

00:01:56

passed robotpkg-hpp-fcl-ferrum #129516

00:02:56

passed robotpkg-py-hpp-fcl-16.04 #129517

00:04:24

passed robotpkg-py-hpp-fcl-18.04 #129518

00:02:35

passed robotpkg-py-hpp-fcl-20.04 #129519

00:03:27

failed robotpkg-py-hpp-fcl-buster #129520
allowed to fail

00:05:25

passed robotpkg-py-hpp-fcl-ferrum #129521

00:02:40

 
Name Stage Failure
failed
robotpkg-py-hpp-fcl-buster Test

Total Test time (real) = 97.22 sec

The following tests FAILED:
16 - gjk (Child aborted)
Errors while running CTest
make: *** [Makefile:110: test] Error 8
Cleaning up file based variables
ERROR: Job failed: exit code 1
failed
robotpkg-hpp-fcl-buster Test

Total Test time (real) = 53.28 sec

The following tests FAILED:
16 - gjk (Child aborted)
18 - serialization (Child aborted)
Errors while running CTest
make: *** [Makefile:110: test] Error 8
Cleaning up file based variables
ERROR: Job failed: exit code 1
failed
format Test
./python/hppfcl/viewer.py:55:17: E128 continuation line under-indented for visual indent
./python/hppfcl/viewer.py:55:95: E231 missing whitespace after ','
./python/hppfcl/viewer.py:55:97: E231 missing whitespace after ','
./python/hppfcl/viewer.py:55:120: E501 line too long (132 > 119 characters)
./python/hppfcl/viewer.py:58:1: E302 expected 2 blank lines, found 1
./python/hppfcl/viewer.py:77:21: E128 continuation line under-indented for visual indent
./python/hppfcl/viewer.py:77:65: E231 missing whitespace after ','
./python/hppfcl/viewer.py:77:67: E231 missing whitespace after ','
Cleaning up file based variables
ERROR: Job failed: exit code 1