debug

14 jobs for pr/239 in 60 minutes and 33 seconds (queued for 8 seconds)
Status Name Job ID Coverage
  Test
passed doc-coverage #128752

01:00:30

77.0%
failed format #128753
allowed to fail

00:00:14

failed robotpkg-hpp-fcl-16.04 #128740
allowed to fail

00:00:02

passed robotpkg-hpp-fcl-18.04 #128741

00:02:19

passed robotpkg-hpp-fcl-20.04 #128742

00:01:46

failed robotpkg-hpp-fcl-buster #128743
allowed to fail

00:11:42

passed robotpkg-hpp-fcl-ferrum #128744

00:09:20

passed robotpkg-hpp-fcl-stretch #128745

00:12:23

failed robotpkg-py-hpp-fcl-16.04 #128746
allowed to fail

00:00:03

passed robotpkg-py-hpp-fcl-18.04 #128747

00:20:29

passed robotpkg-py-hpp-fcl-20.04 #128748

00:25:07

failed robotpkg-py-hpp-fcl-buster #128749
allowed to fail

00:15:58

passed robotpkg-py-hpp-fcl-ferrum #128750

00:20:39

passed robotpkg-py-hpp-fcl-stretch #128751

00:18:25

 
Name Stage Failure
failed
robotpkg-py-hpp-fcl-buster Test
95% tests passed, 1 tests failed out of 21

Total Test time (real) = 47.05 sec

The following tests FAILED:
16 - gjk (Child aborted)
Errors while running CTest
make: *** [Makefile:110: test] Error 8
Cleaning up file based variables
ERROR: Job failed: exit code 1
failed
robotpkg-hpp-fcl-buster Test

Total Test time (real) = 87.87 sec

The following tests FAILED:
16 - gjk (Child aborted)
18 - serialization (Child aborted)
Errors while running CTest
make: *** [Makefile:110: test] Error 8
Cleaning up file based variables
ERROR: Job failed: exit code 1
failed
format Test
./doc/python/xml_docstring.py:143:19: E211 whitespace before '('
./doc/python/xml_docstring.py:147:23: E211 whitespace before '('
./doc/python/xml_docstring.py:149:17: E211 whitespace before '('
./doc/python/xml_docstring.py:150:20: E211 whitespace before '('
./doc/python/xml_docstring.py:151:23: E211 whitespace before '('
./doc/python/xml_docstring.py:153:16: E211 whitespace before '('
./doc/python/xml_docstring.py:156:28: E211 whitespace before '('
./doc/python/xml_docstring.py:158:28: E211 whitespace before '('
Cleaning up file based variables
ERROR: Job failed: exit code 1
failed
robotpkg-py-hpp-fcl-16.04 Test
Running with gitlab-runner 14.2.0 (58ba2b95)
on miyanoura 7bNHsp4m

Preparing the "docker" executor
Using Docker executor with image memmos.laas.fr:5000/humanoid-path-planner/hpp-fcl/py-hpp-fcl:16.04 ...
Pulling docker image memmos.laas.fr:5000/humanoid-path-planner/hpp-fcl/py-hpp-fcl:16.04 ...

WARNING: Failed to pull image with policy "always": Error response from daemon: manifest for memmos.laas.fr:5000/humanoid-path-planner/hpp-fcl/py-hpp-fcl:16.04 not found: manifest unknown: manifest unknown (manager.go:205:0s)
ERROR: Job failed: failed to pull image "memmos.laas.fr:5000/humanoid-path-planner/hpp-fcl/py-hpp-fcl:16.04" with specified policies [always]: Error response from daemon: manifest for memmos.laas.fr:5000/humanoid-path-planner/hpp-fcl/py-hpp-fcl:16.04 not found: manifest unknown: manifest unknown (manager.go:205:0s)
failed
robotpkg-hpp-fcl-16.04 Test
Running with gitlab-runner 14.2.0 (58ba2b95)
on miyanoura 7bNHsp4m

Preparing the "docker" executor
Using Docker executor with image memmos.laas.fr:5000/humanoid-path-planner/hpp-fcl/hpp-fcl:16.04 ...
Pulling docker image memmos.laas.fr:5000/humanoid-path-planner/hpp-fcl/hpp-fcl:16.04 ...

WARNING: Failed to pull image with policy "always": Error response from daemon: manifest for memmos.laas.fr:5000/humanoid-path-planner/hpp-fcl/hpp-fcl:16.04 not found: manifest unknown: manifest unknown (manager.go:205:0s)
ERROR: Job failed: failed to pull image "memmos.laas.fr:5000/humanoid-path-planner/hpp-fcl/hpp-fcl:16.04" with specified policies [always]: Error response from daemon: manifest for memmos.laas.fr:5000/humanoid-path-planner/hpp-fcl/hpp-fcl:16.04 not found: manifest unknown: manifest unknown (manager.go:205:0s)