ci: enable GENERATE_PYTHON_STUBS=ON

14 jobs for pr/239 in 94 minutes and 22 seconds (queued for 9 seconds)
Status Name Job ID Coverage
  Test
passed doc-coverage #128590

01:34:19

77.0%
failed format #128591
allowed to fail

00:00:10

failed robotpkg-hpp-fcl-16.04 #128578
allowed to fail

00:00:03

passed robotpkg-hpp-fcl-18.04 #128579

00:10:35

passed robotpkg-hpp-fcl-20.04 #128580

00:08:28

failed robotpkg-hpp-fcl-buster #128581
allowed to fail

00:18:57

passed robotpkg-hpp-fcl-ferrum #128582

00:09:03

passed robotpkg-hpp-fcl-stretch #128583

00:09:15

failed robotpkg-py-hpp-fcl-16.04 #128584
allowed to fail

00:00:02

passed robotpkg-py-hpp-fcl-18.04 #128585

00:14:32

passed robotpkg-py-hpp-fcl-20.04 #128586

00:18:27

failed robotpkg-py-hpp-fcl-buster #128587
allowed to fail

00:16:21

passed robotpkg-py-hpp-fcl-ferrum #128588

00:16:39

passed robotpkg-py-hpp-fcl-stretch #128589

00:11:20

 
Name Stage Failure
failed
robotpkg-hpp-fcl-buster Test
Total Test time (real) =  99.63 sec

The following tests FAILED:
16 - gjk (Child aborted)
18 - serialization (Child aborted)
Errors while running CTest
make: *** [Makefile:110: test] Error 8
Cleaning up file based variables
ERROR: Job failed: exit code 1
failed
robotpkg-py-hpp-fcl-buster Test
95% tests passed, 1 tests failed out of 21

Total Test time (real) = 47.29 sec

The following tests FAILED:
16 - gjk (Child aborted)
Errors while running CTest
make: *** [Makefile:110: test] Error 8
Cleaning up file based variables
ERROR: Job failed: exit code 1
failed
format Test
./python/hppfcl/viewer.py:55:17: E128 continuation line under-indented for visual indent
./python/hppfcl/viewer.py:55:95: E231 missing whitespace after ','
./python/hppfcl/viewer.py:55:97: E231 missing whitespace after ','
./python/hppfcl/viewer.py:55:120: E501 line too long (132 > 119 characters)
./python/hppfcl/viewer.py:58:1: E302 expected 2 blank lines, found 1
./python/hppfcl/viewer.py:77:21: E128 continuation line under-indented for visual indent
./python/hppfcl/viewer.py:77:65: E231 missing whitespace after ','
./python/hppfcl/viewer.py:77:67: E231 missing whitespace after ','
Cleaning up file based variables
ERROR: Job failed: exit code 1
failed
robotpkg-py-hpp-fcl-16.04 Test
Running with gitlab-runner 14.2.0 (58ba2b95)
on blade qTZ7NXCE

Preparing the "docker" executor
Using Docker executor with image memmos.laas.fr:5000/humanoid-path-planner/hpp-fcl/py-hpp-fcl:16.04 ...
Pulling docker image memmos.laas.fr:5000/humanoid-path-planner/hpp-fcl/py-hpp-fcl:16.04 ...

WARNING: Failed to pull image with policy "always": Error response from daemon: manifest for memmos.laas.fr:5000/humanoid-path-planner/hpp-fcl/py-hpp-fcl:16.04 not found: manifest unknown: manifest unknown (manager.go:205:0s)
ERROR: Job failed: failed to pull image "memmos.laas.fr:5000/humanoid-path-planner/hpp-fcl/py-hpp-fcl:16.04" with specified policies [always]: Error response from daemon: manifest for memmos.laas.fr:5000/humanoid-path-planner/hpp-fcl/py-hpp-fcl:16.04 not found: manifest unknown: manifest unknown (manager.go:205:0s)
failed
robotpkg-hpp-fcl-16.04 Test
Running with gitlab-runner 14.2.0 (58ba2b95)
on asahi zUWCHYoo

Preparing the "docker" executor
Using Docker executor with image memmos.laas.fr:5000/humanoid-path-planner/hpp-fcl/hpp-fcl:16.04 ...
Pulling docker image memmos.laas.fr:5000/humanoid-path-planner/hpp-fcl/hpp-fcl:16.04 ...

WARNING: Failed to pull image with policy "always": Error response from daemon: manifest for memmos.laas.fr:5000/humanoid-path-planner/hpp-fcl/hpp-fcl:16.04 not found: manifest unknown: manifest unknown (manager.go:205:0s)
ERROR: Job failed: failed to pull image "memmos.laas.fr:5000/humanoid-path-planner/hpp-fcl/hpp-fcl:16.04" with specified policies [always]: Error response from daemon: manifest for memmos.laas.fr:5000/humanoid-path-planner/hpp-fcl/hpp-fcl:16.04 not found: manifest unknown: manifest unknown (manager.go:205:0s)