Merge pull request #238 from nim65s/devel

badges: add PyPI
17 jobs for devel in 42 minutes and 52 seconds (queued for 3 seconds)
Name Stage Failure
failed
robotpkg-hpp-fcl-buster Test
Total Test time (real) =  97.63 sec

The following tests FAILED:
Errors while running CTest
16 - gjk (Child aborted)
18 - serialization (Child aborted)
make: *** [Makefile:110: test] Error 8
Cleaning up file based variables
ERROR: Job failed: exit code 1
failed
robotpkg-py-hpp-fcl-buster Test
95% tests passed, 1 tests failed out of 21

Total Test time (real) = 42.47 sec

The following tests FAILED:
16 - gjk (Child aborted)
Errors while running CTest
make: *** [Makefile:110: test] Error 8
Cleaning up file based variables
ERROR: Job failed: exit code 1
failed
robotpkg-hpp-fcl-16.04 Test
Running with gitlab-runner 14.2.0 (58ba2b95)
on obamisan Ke6DzkHD

Preparing the "docker" executor
Using Docker executor with image memmos.laas.fr:5000/humanoid-path-planner/hpp-fcl/hpp-fcl:16.04 ...
Pulling docker image memmos.laas.fr:5000/humanoid-path-planner/hpp-fcl/hpp-fcl:16.04 ...

WARNING: Failed to pull image with policy "always": Error response from daemon: manifest for memmos.laas.fr:5000/humanoid-path-planner/hpp-fcl/hpp-fcl:16.04 not found: manifest unknown: manifest unknown (manager.go:205:0s)
ERROR: Job failed: failed to pull image "memmos.laas.fr:5000/humanoid-path-planner/hpp-fcl/hpp-fcl:16.04" with specified policies [always]: Error response from daemon: manifest for memmos.laas.fr:5000/humanoid-path-planner/hpp-fcl/hpp-fcl:16.04 not found: manifest unknown: manifest unknown (manager.go:205:0s)
failed
robotpkg-py-hpp-fcl-16.04 Test
Running with gitlab-runner 14.2.0 (58ba2b95)
on senjosan sWwLEjyc

Preparing the "docker" executor
Using Docker executor with image memmos.laas.fr:5000/humanoid-path-planner/hpp-fcl/py-hpp-fcl:16.04 ...
Pulling docker image memmos.laas.fr:5000/humanoid-path-planner/hpp-fcl/py-hpp-fcl:16.04 ...

WARNING: Failed to pull image with policy "always": Error response from daemon: manifest for memmos.laas.fr:5000/humanoid-path-planner/hpp-fcl/py-hpp-fcl:16.04 not found: manifest unknown: manifest unknown (manager.go:205:0s)
ERROR: Job failed: failed to pull image "memmos.laas.fr:5000/humanoid-path-planner/hpp-fcl/py-hpp-fcl:16.04" with specified policies [always]: Error response from daemon: manifest for memmos.laas.fr:5000/humanoid-path-planner/hpp-fcl/py-hpp-fcl:16.04 not found: manifest unknown: manifest unknown (manager.go:205:0s)
failed
format Test
./doc/python/doxygen_xml_parser.py:698:18: E211 whitespace before '('
./doc/python/doxygen_xml_parser.py:698:25: E251 unexpected spaces around keyword / parameter equals
./doc/python/doxygen_xml_parser.py:698:27: E251 unexpected spaces around keyword / parameter equals
./doc/python/doxygen_xml_parser.py:699:13: E128 continuation line under-indented for visual indent
./doc/python/doxygen_xml_parser.py:699:19: E251 unexpected spaces around keyword / parameter equals
./doc/python/doxygen_xml_parser.py:699:21: E251 unexpected spaces around keyword / parameter equals
./doc/python/doxygen_xml_parser.py:699:35: E211 whitespace before '('
./doc/python/doxygen_xml_parser.py:703:30: E711 comparison to None should be 'if cond is None:'
Cleaning up file based variables
ERROR: Job failed: exit code 1