readme: remove useless badge

14 jobs for pr/238 in 46 minutes and 10 seconds (queued for 8 seconds)
Status Name Job ID Coverage
  Test
passed doc-coverage #127137

00:46:07

77.0%
failed format #127138
allowed to fail

00:00:12

failed robotpkg-hpp-fcl-16.04 #127125
allowed to fail

00:03:38

passed robotpkg-hpp-fcl-18.04 #127126

00:22:40

passed robotpkg-hpp-fcl-20.04 #127127

00:24:41

failed robotpkg-hpp-fcl-buster #127128
allowed to fail

00:23:01

passed robotpkg-hpp-fcl-ferrum #127129

00:09:16

passed robotpkg-hpp-fcl-stretch #127130

00:19:27

failed robotpkg-py-hpp-fcl-16.04 #127131
allowed to fail

00:00:03

passed robotpkg-py-hpp-fcl-18.04 #127132

00:31:06

passed robotpkg-py-hpp-fcl-20.04 #127133

00:36:43

failed robotpkg-py-hpp-fcl-buster #127134
allowed to fail

00:21:32

passed robotpkg-py-hpp-fcl-ferrum #127135

00:17:39

passed robotpkg-py-hpp-fcl-stretch #127136

00:33:09

 
Name Stage Failure
failed
robotpkg-hpp-fcl-buster Test

Total Test time (real) = 94.87 sec

The following tests FAILED:
Errors while running CTest
16 - gjk (Child aborted)
18 - serialization (Child aborted)
make: *** [Makefile:110: test] Error 8
Cleaning up file based variables
ERROR: Job failed: exit code 1
failed
robotpkg-py-hpp-fcl-buster Test
95% tests passed, 1 tests failed out of 21

Total Test time (real) = 56.39 sec

The following tests FAILED:
16 - gjk (Child aborted)
Errors while running CTest
make: *** [Makefile:110: test] Error 8
Cleaning up file based variables
ERROR: Job failed: exit code 1
failed
robotpkg-hpp-fcl-16.04 Test
Running with gitlab-runner 14.2.0 (58ba2b95)
on senjosan sWwLEjyc

Preparing the "docker" executor
Using Docker executor with image memmos.laas.fr:5000/humanoid-path-planner/hpp-fcl/hpp-fcl:16.04 ...
ERROR: Preparation failed: adding cache volume: set volume permissions: create permission container for volume "runner-swwlejyc-project-88-concurrent-1-cache-3c3f060a0374fc8bc39395164f415a70": Cannot connect to the Docker daemon at unix:///var/run/docker.sock. Is the docker daemon running? (linux_set.go:95:120s)
Will be retried in 3s ...
Using Docker executor with image memmos.laas.fr:5000/humanoid-path-planner/hpp-fcl/hpp-fcl:16.04 ...

Pulling docker image memmos.laas.fr:5000/humanoid-path-planner/hpp-fcl/hpp-fcl:16.04 ...

WARNING: Failed to pull image with policy "always": Error response from daemon: manifest for memmos.laas.fr:5000/humanoid-path-planner/hpp-fcl/hpp-fcl:16.04 not found: manifest unknown: manifest unknown (manager.go:205:0s)
ERROR: Job failed: failed to pull image "memmos.laas.fr:5000/humanoid-path-planner/hpp-fcl/hpp-fcl:16.04" with specified policies [always]: Error response from daemon: manifest for memmos.laas.fr:5000/humanoid-path-planner/hpp-fcl/hpp-fcl:16.04 not found: manifest unknown: manifest unknown (manager.go:205:0s)
failed
format Test
./python/hppfcl/viewer.py:58:1: E302 expected 2 blank lines, found 1
./python/hppfcl/viewer.py:77:21: E128 continuation line under-indented for visual indent
./python/hppfcl/viewer.py:77:65: E231 missing whitespace after ','
./python/hppfcl/viewer.py:77:67: E231 missing whitespace after ','
./python/hppfcl/__init__.py:34:1: F403 'from .hppfcl import *' used; unable to detect undefined names
./python/hppfcl/__init__.py:34:1: F401 '.hppfcl.*' imported but unused
./python/hppfcl/__init__.py:35:1: F401 '.hppfcl.__version__' imported but unused
./python/hppfcl/__init__.py:35:1: F401 '.hppfcl.__raw_version__' imported but unused
Cleaning up file based variables
ERROR: Job failed: exit code 1
failed
robotpkg-py-hpp-fcl-16.04 Test
Running with gitlab-runner 14.2.0 (58ba2b95)
on miyanoura 7bNHsp4m

Preparing the "docker" executor
Using Docker executor with image memmos.laas.fr:5000/humanoid-path-planner/hpp-fcl/py-hpp-fcl:16.04 ...
Pulling docker image memmos.laas.fr:5000/humanoid-path-planner/hpp-fcl/py-hpp-fcl:16.04 ...

WARNING: Failed to pull image with policy "always": Error response from daemon: manifest for memmos.laas.fr:5000/humanoid-path-planner/hpp-fcl/py-hpp-fcl:16.04 not found: manifest unknown: manifest unknown (manager.go:205:0s)
ERROR: Job failed: failed to pull image "memmos.laas.fr:5000/humanoid-path-planner/hpp-fcl/py-hpp-fcl:16.04" with specified policies [always]: Error response from daemon: manifest for memmos.laas.fr:5000/humanoid-path-planner/hpp-fcl/py-hpp-fcl:16.04 not found: manifest unknown: manifest unknown (manager.go:205:0s)