badges: add PyPI

16 jobs for pr/238 in 41 minutes and 54 seconds (queued for 8 seconds)
Status Name Job ID Coverage
  Test
passed doc-coverage #127109

00:41:32

77.0%
failed format #127111
allowed to fail

00:05:35

failed robotpkg-hpp-fcl-16.04 #127116
allowed to fail

00:00:13

passed robotpkg-hpp-fcl-18.04 #127090

00:11:25

passed robotpkg-hpp-fcl-20.04 #127091

00:24:14

failed robotpkg-hpp-fcl-buster #127092
allowed to fail

00:22:05

passed robotpkg-hpp-fcl-ferrum #127093

00:10:48

passed robotpkg-hpp-fcl-stretch #127094

00:13:03

failed robotpkg-py-hpp-fcl-16.04 #127096
allowed to fail

00:00:03

passed robotpkg-py-hpp-fcl-18.04 #127098

00:41:50

passed robotpkg-py-hpp-fcl-20.04 #127102

00:40:19

failed robotpkg-py-hpp-fcl-buster #127104
allowed to fail

00:34:45

passed robotpkg-py-hpp-fcl-ferrum #127106

00:38:35

passed robotpkg-py-hpp-fcl-stretch #127107

00:36:37

failed robotpkg-hpp-fcl-16.04 #127115
allowed to fail

00:00:09

failed robotpkg-hpp-fcl-16.04 #127089
allowed to fail

00:00:31

 
Name Stage Failure
failed
robotpkg-py-hpp-fcl-buster Test
95% tests passed, 1 tests failed out of 21

Total Test time (real) = 105.60 sec

The following tests FAILED:
16 - gjk (Child aborted)
Errors while running CTest
make: *** [Makefile:110: test] Error 8
Cleaning up file based variables
ERROR: Job failed: exit code 1
failed
robotpkg-hpp-fcl-buster Test

Total Test time (real) = 99.78 sec

The following tests FAILED:
16 - gjk (Child aborted)
18 - serialization (Child aborted)
make: *** [Makefile:110: test] Error 8
Cleaning up file based variables
ERROR: Job failed: exit code 1
failed
format Test
./doc/python/doxygen_xml_parser.py:698:18: E211 whitespace before '('
./doc/python/doxygen_xml_parser.py:698:25: E251 unexpected spaces around keyword / parameter equals
./doc/python/doxygen_xml_parser.py:698:27: E251 unexpected spaces around keyword / parameter equals
./doc/python/doxygen_xml_parser.py:699:13: E128 continuation line under-indented for visual indent
./doc/python/doxygen_xml_parser.py:699:19: E251 unexpected spaces around keyword / parameter equals
./doc/python/doxygen_xml_parser.py:699:21: E251 unexpected spaces around keyword / parameter equals
./doc/python/doxygen_xml_parser.py:699:35: E211 whitespace before '('
./doc/python/doxygen_xml_parser.py:703:30: E711 comparison to None should be 'if cond is None:'
Cleaning up file based variables
ERROR: Job failed: exit code 1
failed
robotpkg-hpp-fcl-16.04 Test There has been a runner system failure, please try again
Running with gitlab-runner 13.11.0 (7f7a4bb0)
on eur0c 5ns_aKV6
Preparing the "docker" executor
Using Docker executor with image memmos.laas.fr:5000/humanoid-path-planner/hpp-fcl/hpp-fcl:16.04 ...
Pulling docker image memmos.laas.fr:5000/humanoid-path-planner/hpp-fcl/hpp-fcl:16.04 ...
WARNING: Failed to pull image with policy "always": Error response from daemon: manifest for memmos.laas.fr:5000/humanoid-path-planner/hpp-fcl/hpp-fcl:16.04 not found: manifest unknown: manifest unknown (manager.go:205:0s)
ERROR: Job failed (system failure): failed to pull image "memmos.laas.fr:5000/humanoid-path-planner/hpp-fcl/hpp-fcl:16.04" with specified policies [always]: Error response from daemon: manifest for memmos.laas.fr:5000/humanoid-path-planner/hpp-fcl/hpp-fcl:16.04 not found: manifest unknown: manifest unknown (manager.go:205:0s)
failed
robotpkg-py-hpp-fcl-16.04 Test
Running with gitlab-runner 14.2.0 (58ba2b95)
on asahi zUWCHYoo

Preparing the "docker" executor
Using Docker executor with image memmos.laas.fr:5000/humanoid-path-planner/hpp-fcl/py-hpp-fcl:16.04 ...
Pulling docker image memmos.laas.fr:5000/humanoid-path-planner/hpp-fcl/py-hpp-fcl:16.04 ...

WARNING: Failed to pull image with policy "always": Error response from daemon: manifest for memmos.laas.fr:5000/humanoid-path-planner/hpp-fcl/py-hpp-fcl:16.04 not found: manifest unknown: manifest unknown (manager.go:205:0s)
ERROR: Job failed: failed to pull image "memmos.laas.fr:5000/humanoid-path-planner/hpp-fcl/py-hpp-fcl:16.04" with specified policies [always]: Error response from daemon: manifest for memmos.laas.fr:5000/humanoid-path-planner/hpp-fcl/py-hpp-fcl:16.04 not found: manifest unknown: manifest unknown (manager.go:205:0s)