case

Co-authored-by: Justin Carpentier <justin.carpentier@inria.fr>
10 jobs for pr/234 in 90 minutes and 29 seconds (queued for 2 seconds)
Status Name Job ID Coverage
  Test
passed doc-coverage #122504

01:30:27

77.0%
failed format #122505
allowed to fail

00:00:10

passed robotpkg-hpp-fcl-18.04-release #122496

00:04:33

passed robotpkg-py-hpp-fcl-py2-18.04-release #122498

00:13:47

failed robotpkg-py-hpp-fcl-py3-16.04-release #122497
allowed to fail

00:02:29

passed robotpkg-py-hpp-fcl-py3-18.04-release #122499

00:17:10

passed robotpkg-py-hpp-fcl-py3-20.04-release #122500

00:26:42

failed robotpkg-py-hpp-fcl-py3-buster-release #122501
allowed to fail

00:36:07

passed robotpkg-py-hpp-fcl-py3-ferrum-release #122502

00:19:06

failed robotpkg-py-hpp-fcl-py3-stretch-release #122503

00:05:10

 
Name Stage Failure
failed
robotpkg-py-hpp-fcl-py3-buster-release Test

Total Test time (real) = 101.64 sec

The following tests FAILED:
16 - gjk (Child aborted)
Errors while running CTest
make: *** [Makefile:110: test] Error 8
Cleaning up file based variables
ERROR: Job failed: exit code 1
failed
robotpkg-py-hpp-fcl-py3-stretch-release Test
/root/robotpkg/path/hpp-fcl/work/configure.log
/root/robotpkg/mk/configure/cmake-configure.mk:100: recipe for target 'do-configure-cmake' failed
make[1]: *** [do-configure-cmake] Error 1
/root/robotpkg/mk/depends/depends.mk:70: recipe for target 'do-depends' failed
make: *** [do-depends] Error 1
make: *** [install] Error 2
/root/robotpkg/mk/internal/trusted.mk:36: recipe for target 'install' failed
Cleaning up file based variables
ERROR: Job failed: exit code 1
failed
robotpkg-py-hpp-fcl-py3-16.04-release Test
/root/robotpkg/path/hpp-fcl/work/configure.log
/root/robotpkg/mk/configure/cmake-configure.mk:100: recipe for target 'do-configure-cmake' failed
make[1]: *** [do-configure-cmake] Error 1
/root/robotpkg/mk/depends/depends.mk:70: recipe for target 'do-depends' failed
make: *** [do-depends] Error 1
/root/robotpkg/mk/internal/trusted.mk:36: recipe for target 'install' failed
make: *** [install] Error 2
Cleaning up file based variables
ERROR: Job failed: exit code 1
failed
format Test
./test/scripts/gjk.py:34:22: E211 whitespace before '('
./test/scripts/gjk.py:35:17: E211 whitespace before '('
./test/scripts/gjk.py:36:17: E211 whitespace before '('
./test/scripts/gjk.py:38:25: E211 whitespace before '('
./test/scripts/gjk.py:39:25: E211 whitespace before '('
./test/scripts/gjk.py:40:14: E211 whitespace before '('
./test/scripts/gjk.py:41:1: W391 blank line at end of file
Cleaning up file based variables
ERROR: Job failed: exit code 1