ros: update version

9 jobs for v1.2.2 in 15 minutes and 29 seconds (queued for 12 minutes and 15 seconds)
latest
Status Name Job ID Coverage
  Test
failed doc-coverage #115669

00:12:11

failed format #115670
allowed to fail

00:00:18

passed robotpkg-hpp-fcl-18.04-release #115662

00:12:52

failed robotpkg-py-hpp-fcl-py2-18.04-release #115664

00:11:02

failed robotpkg-py-hpp-fcl-py3-16.04-release #115663
allowed to fail

00:06:59

failed robotpkg-py-hpp-fcl-py3-18.04-release #115665
allowed to fail

00:07:57

failed robotpkg-py-hpp-fcl-py3-20.04-release #115666

00:08:54

failed robotpkg-py-hpp-fcl-py3-buster-release #115667
allowed to fail

00:08:36

failed robotpkg-py-hpp-fcl-py3-stretch-release #115668
allowed to fail

00:07:44

 
Name Stage Failure
failed
robotpkg-py-hpp-fcl-py3-16.04-release Test
ERROR: 
ERROR: Please reinstall the package in ../../path/hpp-fcl
ERROR: ======================================================================
make: *** [do-depends] Error 1
/root/robotpkg/mk/depends/depends.mk:70: recipe for target 'do-depends' failed
make: *** [install] Error 2
/root/robotpkg/mk/internal/trusted.mk:36: recipe for target 'install' failed
Cleaning up file based variables
ERROR: Job failed: exit code 1
failed
doc-coverage Test
Running after script...
$ cd /root/robotpkg/path/py-hpp-fcl
$ build=$(make show-var VARNAME=CONFIGURE_DIRS); cd $(make show-var VARNAME=WRKSRC); cd $build
$ make doc
make: Nothing to be done for 'doc'.
$ mv doc/doxygen-html ${CI_PROJECT_DIR}
mv: cannot stat 'doc/doxygen-html': No such file or directory
Cleaning up file based variables
ERROR: Job failed: exit code 1
failed
robotpkg-py-hpp-fcl-py3-buster-release Test
ERROR: found:	/opt/openrobots/include/hpp/fcl/config.hh, wrong version 1.2.2
ERROR: missing: /opt/openrobots/include/hpp/fcl/config.hh
ERROR:
ERROR: Please reinstall the package in ../../path/hpp-fcl
ERROR: ======================================================================
make: *** [/root/robotpkg/mk/depends/depends.mk:70: do-depends] Error 1
make: *** [/root/robotpkg/mk/internal/trusted.mk:36: install] Error 2
Cleaning up file based variables
ERROR: Job failed: exit code 1
failed
robotpkg-py-hpp-fcl-py3-20.04-release Test
ERROR: found:	/opt/openrobots/include/hpp/fcl/config.hh, wrong version 1.2.2
ERROR: missing: /opt/openrobots/include/hpp/fcl/config.hh
ERROR:
ERROR: Please reinstall the package in ../../path/hpp-fcl
ERROR: ======================================================================
make: *** [/root/robotpkg/mk/depends/depends.mk:70: do-depends] Error 1
make: *** [/root/robotpkg/mk/internal/trusted.mk:36: install] Error 2
Cleaning up file based variables
ERROR: Job failed: exit code 1
failed
robotpkg-py-hpp-fcl-py2-18.04-release Test
ERROR: 
ERROR: Please reinstall the package in ../../path/hpp-fcl
ERROR: ======================================================================
make: *** [do-depends] Error 1
/root/robotpkg/mk/depends/depends.mk:70: recipe for target 'do-depends' failed
make: *** [install] Error 2
/root/robotpkg/mk/internal/trusted.mk:36: recipe for target 'install' failed
Cleaning up file based variables
ERROR: Job failed: exit code 1
failed
robotpkg-py-hpp-fcl-py3-stretch-release Test
ERROR: 
ERROR: Please reinstall the package in ../../path/hpp-fcl
ERROR: ======================================================================
/root/robotpkg/mk/depends/depends.mk:70: recipe for target 'do-depends' failed
make: *** [do-depends] Error 1
make: *** [install] Error 2
/root/robotpkg/mk/internal/trusted.mk:36: recipe for target 'install' failed
Cleaning up file based variables
ERROR: Job failed: exit code 1
failed
robotpkg-py-hpp-fcl-py3-18.04-release Test
ERROR: 
ERROR: Please reinstall the package in ../../path/hpp-fcl
ERROR: ======================================================================
/root/robotpkg/mk/depends/depends.mk:70: recipe for target 'do-depends' failed
make: *** [do-depends] Error 1
/root/robotpkg/mk/internal/trusted.mk:36: recipe for target 'install' failed
make: *** [install] Error 2
Cleaning up file based variables
ERROR: Job failed: exit code 1
failed
format Test
-}
+} // namespace fcl

-} // namespace hpp
+} // namespace hpp

#endif
Cleaning up file based variables
ERROR: Job failed: exit code 1