[Tests] add missing include

fix:

/src/hpp-fcl/test/collision.cpp:228:9: error: no template named 'vector' in namespace 'boost::mpl'; did you mean 'boost::container::vector'?
typedef boost::mpl::vector<OBB, RSS, KDOP<24>, KDOP<18>, KDOP<16>, kIOS, OBBRSS> BVs_t;
        ^~~~~~~~~~~~~~~~~~
        boost::container::vector
/usr/local/include/boost/container/container_fwd.hpp:104:7: note: 'boost::container::vector' declared here
class vector;
      ^
/src/hpp-fcl/test/collision.cpp:228:21: error: too many template arguments for class template 'vector'
typedef boost::mpl::vector<OBB, RSS, KDOP<24>, KDOP<18>, KDOP<16>, kIOS, OBBRSS> BVs_t;
                    ^                          ~~~~~~~~~~~~~~~~~~~~~~~~~~~~~~~~~
/usr/local/include/boost/container/container_fwd.hpp:104:7: note: template is declared here
class vector;
      ^
10 jobs for topic/perf in 92 minutes and 31 seconds (queued for 2 seconds)
latest
Status Name Job ID Coverage
  Test
passed doc-coverage #121036

01:32:29

failed format #121037
allowed to fail

00:00:11

passed robotpkg-hpp-fcl-18.04-release #121028

00:17:43

passed robotpkg-py-hpp-fcl-py2-18.04-release #121030

00:15:56

passed robotpkg-py-hpp-fcl-py3-16.04-release #121029

00:11:36

passed robotpkg-py-hpp-fcl-py3-18.04-release #121031

00:14:42

passed robotpkg-py-hpp-fcl-py3-20.04-release #121032

00:20:08

failed robotpkg-py-hpp-fcl-py3-buster-release #121033
allowed to fail

00:35:29

passed robotpkg-py-hpp-fcl-py3-ferrum-release #121034

00:14:37

passed robotpkg-py-hpp-fcl-py3-stretch-release #121035

00:18:09

 
Name Stage Failure
failed
format Test
-}
+} // namespace fcl

-} // namespace hpp
+} // namespace hpp

#endif
Cleaning up file based variables
ERROR: Job failed: exit code 1
failed
robotpkg-py-hpp-fcl-py3-buster-release Test

Total Test time (real) = 98.93 sec

The following tests FAILED:
16 - gjk (Child aborted)
Errors while running CTest
make: *** [Makefile:110: test] Error 8
Cleaning up file based variables
ERROR: Job failed: exit code 1