v2.4.4

14 jobs for topic/multipy2 in 3 minutes and 2 seconds (queued for 2 seconds)
latest
Status Job ID Name Coverage
  Test
failed #87813
doc-coverage

00:00:20

failed #87814
allowed to fail
format

00:00:18

failed #87801
robotpkg-py-eigenpy-16.04-debug

00:00:16

failed #87802
robotpkg-py-eigenpy-16.04-release

00:01:04

failed #87808
robotpkg-py-eigenpy-18.04-debug

00:01:05

failed #87807
robotpkg-py-eigenpy-18.04-release

00:00:15

failed #87803
robotpkg-py-eigenpy-py3-16.04-debug

00:00:18

failed #87804
robotpkg-py-eigenpy-py3-16.04-release

00:03:01

failed #87806
robotpkg-py-eigenpy-py3-18.04-debug

00:00:19

failed #87805
robotpkg-py-eigenpy-py3-18.04-release

00:00:14

failed #87812
robotpkg-py-eigenpy-py3-stretch-debug

00:01:04

failed #87811
robotpkg-py-eigenpy-py3-stretch-release

00:00:15

failed #87809
robotpkg-py-eigenpy-stretch-debug

00:00:21

failed #87810
robotpkg-py-eigenpy-stretch-release

00:00:13

 
Name Stage Failure
failed
robotpkg-py-eigenpy-py3-16.04-release Test
| Unable to checkout 'efd97e118af01a0557a9dd966250c2a414a8677e' in submodule path 'cmake'

For details or bug reports, check the complete log file in:
/root/robotpkg/math/py-eigenpy/work.runner-5nsakv6-project-41-concurrent-1/extract.log
make: *** [do-checkout] Error 1
/root/robotpkg/mk/extract/checkout.mk:225: recipe for target 'do-checkout' failed
/root/robotpkg/mk/internal/trusted.mk:36: recipe for target 'checkout' failed
make: *** [checkout] Error 2
ERROR: Job failed: exit code 1
failed
robotpkg-py-eigenpy-py3-stretch-debug Test
| Fetched in submodule path 'cmake', but it did not contain efd97e118af01a0557a9dd966250c2a414a8677e. Direct fetching of that commit failed.

For details or bug reports, check the complete log file in:
/root/robotpkg/math/py-eigenpy/work.runner-5nsakv6-project-41-concurrent-3/extract.log
/root/robotpkg/mk/extract/checkout.mk:225: recipe for target 'do-checkout' failed
make: *** [do-checkout] Error 1
make: *** [checkout] Error 2
/root/robotpkg/mk/internal/trusted.mk:36: recipe for target 'checkout' failed
ERROR: Job failed: exit code 1
failed
robotpkg-py-eigenpy-18.04-debug Test
| Fetched in submodule path 'cmake', but it did not contain efd97e118af01a0557a9dd966250c2a414a8677e. Direct fetching of that commit failed.

For details or bug reports, check the complete log file in:
/root/robotpkg/math/py-eigenpy/work.runner-5nsakv6-project-41-concurrent-2/extract.log
/root/robotpkg/mk/extract/checkout.mk:225: recipe for target 'do-checkout' failed
make: *** [do-checkout] Error 1
make: *** [checkout] Error 2
/root/robotpkg/mk/internal/trusted.mk:36: recipe for target 'checkout' failed
ERROR: Job failed: exit code 1
failed
robotpkg-py-eigenpy-16.04-release Test
| Unable to checkout 'efd97e118af01a0557a9dd966250c2a414a8677e' in submodule path 'cmake'

For details or bug reports, check the complete log file in:
/root/robotpkg/math/py-eigenpy/work.runner-5nsakv6-project-41-concurrent-0/extract.log
/root/robotpkg/mk/extract/checkout.mk:225: recipe for target 'do-checkout' failed
make: *** [do-checkout] Error 1
make: *** [checkout] Error 2
/root/robotpkg/mk/internal/trusted.mk:36: recipe for target 'checkout' failed
ERROR: Job failed: exit code 1
failed
robotpkg-py-eigenpy-stretch-debug Test
| Fetched in submodule path 'cmake', but it did not contain efd97e118af01a0557a9dd966250c2a414a8677e. Direct fetching of that commit failed.
For details or bug reports, check the complete log file in:
/root/robotpkg/math/py-eigenpy/work.runner-swwlejyc-project-41-concurrent-3/extract.log

/root/robotpkg/mk/extract/checkout.mk:225: recipe for target 'do-checkout' failed
make: *** [do-checkout] Error 1
/root/robotpkg/mk/internal/trusted.mk:36: recipe for target 'checkout' failed
make: *** [checkout] Error 2
ERROR: Job failed: exit code 1
failed
doc-coverage Test
Directory: .
------------------------------------------------------------------------------
File Lines Exec Cover Missing
------------------------------------------------------------------------------
------------------------------------------------------------------------------
TOTAL 0 0 --%
------------------------------------------------------------------------------
$ gcovr -r . --html --html-details -o ${CI_PROJECT_DIR}/coverage/index.html
ERROR: Job failed: exit code 1
failed
format Test
   eigenpy::EigenToPyConverter<FloatMatrix>::registration();
- bp::def("create_float",create<float>);
-
- bp::def("build_matrix",build_matrix<double>);
+ bp::def("create_float", create<float>);
+
+ bp::def("build_matrix", build_matrix<double>);
}
ERROR: Job failed: exit code 1
failed
robotpkg-py-eigenpy-py3-18.04-debug Test
| Fetched in submodule path 'cmake', but it did not contain efd97e118af01a0557a9dd966250c2a414a8677e. Direct fetching of that commit failed.

For details or bug reports, check the complete log file in:
/root/robotpkg/math/py-eigenpy/work.runner-swwlejyc-project-41-concurrent-2/extract.log
make: *** [do-checkout] Error 1
/root/robotpkg/mk/extract/checkout.mk:225: recipe for target 'do-checkout' failed
/root/robotpkg/mk/internal/trusted.mk:36: recipe for target 'checkout' failed
make: *** [checkout] Error 2
ERROR: Job failed: exit code 1
failed
robotpkg-py-eigenpy-py3-16.04-debug Test
| Unable to checkout 'efd97e118af01a0557a9dd966250c2a414a8677e' in submodule path 'cmake'
For details or bug reports, check the complete log file in:
/root/robotpkg/math/py-eigenpy/work.runner-swwlejyc-project-41-concurrent-1/extract.log

/root/robotpkg/mk/extract/checkout.mk:225: recipe for target 'do-checkout' failed
make: *** [do-checkout] Error 1
/root/robotpkg/mk/internal/trusted.mk:36: recipe for target 'checkout' failed
make: *** [checkout] Error 2
ERROR: Job failed: exit code 1
failed
robotpkg-py-eigenpy-py3-stretch-release Test
For details or bug reports, check the complete log file in:
/root/robotpkg/math/py-eigenpy/work.runner-qtz7nxce-project-41-concurrent-1/extract.log
make: *** [do-checkout] Error 1
/root/robotpkg/mk/extract/checkout.mk:225: recipe for target 'do-checkout' failed
make: *** [checkout] Error 2
/root/robotpkg/mk/internal/trusted.mk:36: recipe for target 'checkout' failed
Running after_script
Uploading artifacts for failed job
ERROR: Job failed: exit code 1
failed
robotpkg-py-eigenpy-18.04-release Test
For details or bug reports, check the complete log file in:
/root/robotpkg/math/py-eigenpy/work.runner-qtz7nxce-project-41-concurrent-0/extract.log
make: *** [do-checkout] Error 1
/root/robotpkg/mk/extract/checkout.mk:225: recipe for target 'do-checkout' failed
/root/robotpkg/mk/internal/trusted.mk:36: recipe for target 'checkout' failed
make: *** [checkout] Error 2
Running after_script
Uploading artifacts for failed job
ERROR: Job failed: exit code 1
failed
robotpkg-py-eigenpy-16.04-debug Test
| Unable to checkout 'efd97e118af01a0557a9dd966250c2a414a8677e' in submodule path 'cmake'

For details or bug reports, check the complete log file in:
/root/robotpkg/math/py-eigenpy/work.runner-swwlejyc-project-41-concurrent-0/extract.log
/root/robotpkg/mk/extract/checkout.mk:225: recipe for target 'do-checkout' failed
make: *** [do-checkout] Error 1
/root/robotpkg/mk/internal/trusted.mk:36: recipe for target 'checkout' failed
make: *** [checkout] Error 2
ERROR: Job failed: exit code 1
failed
robotpkg-py-eigenpy-stretch-release Test
| Fetched in submodule path 'cmake', but it did not contain efd97e118af01a0557a9dd966250c2a414a8677e. Direct fetching of that commit failed.

For details or bug reports, check the complete log file in:
/root/robotpkg/math/py-eigenpy/work.runner-ke6dzkhd-project-41-concurrent-1/extract.log
make: *** [do-checkout] Error 1
/root/robotpkg/mk/extract/checkout.mk:225: recipe for target 'do-checkout' failed
/root/robotpkg/mk/internal/trusted.mk:36: recipe for target 'checkout' failed
make: *** [checkout] Error 2
ERROR: Job failed: exit code 1
failed
robotpkg-py-eigenpy-py3-18.04-release Test
| Fetched in submodule path 'cmake', but it did not contain efd97e118af01a0557a9dd966250c2a414a8677e. Direct fetching of that commit failed.
For details or bug reports, check the complete log file in:
/root/robotpkg/math/py-eigenpy/work.runner-ke6dzkhd-project-41-concurrent-0/extract.log

make: *** [do-checkout] Error 1
/root/robotpkg/mk/extract/checkout.mk:225: recipe for target 'do-checkout' failed
/root/robotpkg/mk/internal/trusted.mk:36: recipe for target 'checkout' failed
make: *** [checkout] Error 2
ERROR: Job failed: exit code 1