v2.4.4

14 jobs for topic/multipy in 2 minutes and 53 seconds (queued for 2 seconds)
Status Job ID Name Coverage
  Test
failed #87610
doc-coverage

00:02:50

failed #87611
allowed to fail
format

00:00:40

failed #87598
robotpkg-py-eigenpy-16.04-debug

00:02:43

failed #87599
robotpkg-py-eigenpy-16.04-release

00:00:16

failed #87605
robotpkg-py-eigenpy-18.04-debug

00:00:17

failed #87604
robotpkg-py-eigenpy-18.04-release

00:01:07

failed #87600
robotpkg-py-eigenpy-py3-16.04-debug

00:01:07

failed #87601
robotpkg-py-eigenpy-py3-16.04-release

00:02:41

failed #87603
robotpkg-py-eigenpy-py3-18.04-debug

00:00:15

failed #87602
robotpkg-py-eigenpy-py3-18.04-release

00:00:15

failed #87609
robotpkg-py-eigenpy-py3-stretch-debug

00:00:17

failed #87608
robotpkg-py-eigenpy-py3-stretch-release

00:01:46

failed #87606
robotpkg-py-eigenpy-stretch-debug

00:00:32

failed #87607
robotpkg-py-eigenpy-stretch-release

00:00:58

 
Name Stage Failure
failed
doc-coverage Test
------------------------------------------------------------------------------
File Lines Exec Cover Missing
------------------------------------------------------------------------------
------------------------------------------------------------------------------
TOTAL 0 0 --%
------------------------------------------------------------------------------
$ gcovr -r . --html --html-details -o ${CI_PROJECT_DIR}/coverage/index.html
Uploading artifacts for failed job
ERROR: Job failed: exit code 1
failed
robotpkg-py-eigenpy-16.04-debug Test
For details or bug reports, check the complete log file in:
/root/robotpkg/math/py-eigenpy/work.runner-qtz7nxce-project-41-concurrent-0/extract.log
make: *** [do-checkout] Error 1
/root/robotpkg/mk/extract/checkout.mk:225: recipe for target 'do-checkout' failed
make: *** [checkout] Error 2
/root/robotpkg/mk/internal/trusted.mk:36: recipe for target 'checkout' failed
Running after_script
Uploading artifacts for failed job
ERROR: Job failed: exit code 1
failed
robotpkg-py-eigenpy-py3-16.04-release Test
/root/robotpkg/math/py-eigenpy/work.runner-qtz7nxce-project-41-concurrent-1/extract.log

/root/robotpkg/mk/extract/checkout.mk:225: recipe for target 'do-checkout' failed
make: *** [do-checkout] Error 1
/root/robotpkg/mk/internal/trusted.mk:36: recipe for target 'checkout' failed
make: *** [checkout] Error 2
Running after_script
Uploading artifacts for failed job
ERROR: Job failed: exit code 1
failed
robotpkg-py-eigenpy-py3-stretch-release Test
| Fetched in submodule path 'cmake', but it did not contain 2d0d25008ebaba94ca76a428ac031466b5f3bb73. Direct fetching of that commit failed.

For details or bug reports, check the complete log file in:
/root/robotpkg/math/py-eigenpy/work.runner-ke6dzkhd-project-41-concurrent-1/extract.log
make: *** [do-checkout] Error 1
/root/robotpkg/mk/extract/checkout.mk:225: recipe for target 'do-checkout' failed
make: *** [checkout] Error 2
/root/robotpkg/mk/internal/trusted.mk:36: recipe for target 'checkout' failed
ERROR: Job failed: exit code 1
failed
robotpkg-py-eigenpy-18.04-release Test
| Fetched in submodule path 'cmake', but it did not contain 2d0d25008ebaba94ca76a428ac031466b5f3bb73. Direct fetching of that commit failed.

For details or bug reports, check the complete log file in:
/root/robotpkg/math/py-eigenpy/work.runner-5nsakv6-project-41-concurrent-1/extract.log
make: *** [do-checkout] Error 1
/root/robotpkg/mk/extract/checkout.mk:225: recipe for target 'do-checkout' failed
/root/robotpkg/mk/internal/trusted.mk:36: recipe for target 'checkout' failed
make: *** [checkout] Error 2
ERROR: Job failed: exit code 1
failed
robotpkg-py-eigenpy-py3-16.04-debug Test
| Unable to checkout '2d0d25008ebaba94ca76a428ac031466b5f3bb73' in submodule path 'cmake'
For details or bug reports, check the complete log file in:
/root/robotpkg/math/py-eigenpy/work.runner-5nsakv6-project-41-concurrent-0/extract.log

make: *** [do-checkout] Error 1
/root/robotpkg/mk/extract/checkout.mk:225: recipe for target 'do-checkout' failed
make: *** [checkout] Error 2
/root/robotpkg/mk/internal/trusted.mk:36: recipe for target 'checkout' failed
ERROR: Job failed: exit code 1
failed
robotpkg-py-eigenpy-stretch-release Test
| fatal: git fetch-pack: expected ACK/NAK, got 'ERR upload-pack: not our ref 2d0d25008ebaba94ca76a428ac031466b5f3bb73'
| fatal: The remote end hung up unexpectedly
| Fetched in submodule path 'cmake', but it did not contain 2d0d25008ebaba94ca76a428ac031466b5f3bb73. Direct fetching of that commit failed.
For details or bug reports, check the complete log file in:
/root/robotpkg/math/py-eigenpy/work.runner-5nsakv6-project-41-concurrent-2/extract.log
make: *** [do-checkout] Error 1
/root/robotpkg/mk/internal/trusted.mk:36: recipe for target 'checkout' failed
make: *** [checkout] Error 2
ERROR: Job failed: exit code 1
failed
format Test
   eigenpy::EigenToPyConverter<FloatMatrix>::registration();
- bp::def("create_float",create<float>);
-
- bp::def("build_matrix",build_matrix<double>);
+ bp::def("create_float", create<float>);
+
+ bp::def("build_matrix", build_matrix<double>);
}
ERROR: Job failed: exit code 1
failed
robotpkg-py-eigenpy-stretch-debug Test
For details or bug reports, check the complete log file in:
/root/robotpkg/math/py-eigenpy/work.runner-qtz7nxce-project-41-concurrent-2/extract.log
/root/robotpkg/mk/extract/checkout.mk:225: recipe for target 'do-checkout' failed
make: *** [do-checkout] Error 1
/root/robotpkg/mk/internal/trusted.mk:36: recipe for target 'checkout' failed
make: *** [checkout] Error 2
Running after_script
Uploading artifacts for failed job
ERROR: Job failed: exit code 1
failed
robotpkg-py-eigenpy-py3-stretch-debug Test
| Fetched in submodule path 'cmake', but it did not contain 2d0d25008ebaba94ca76a428ac031466b5f3bb73. Direct fetching of that commit failed.

For details or bug reports, check the complete log file in:
/root/robotpkg/math/py-eigenpy/work.runner-swwlejyc-project-41-concurrent-3/extract.log
make: *** [do-checkout] Error 1
/root/robotpkg/mk/extract/checkout.mk:225: recipe for target 'do-checkout' failed
make: *** [checkout] Error 2
/root/robotpkg/mk/internal/trusted.mk:36: recipe for target 'checkout' failed
ERROR: Job failed: exit code 1
failed
robotpkg-py-eigenpy-18.04-debug Test
| Fetched in submodule path 'cmake', but it did not contain 2d0d25008ebaba94ca76a428ac031466b5f3bb73. Direct fetching of that commit failed.
For details or bug reports, check the complete log file in:
/root/robotpkg/math/py-eigenpy/work.runner-swwlejyc-project-41-concurrent-2/extract.log

/root/robotpkg/mk/extract/checkout.mk:225: recipe for target 'do-checkout' failed
make: *** [do-checkout] Error 1
/root/robotpkg/mk/internal/trusted.mk:36: recipe for target 'checkout' failed
make: *** [checkout] Error 2
ERROR: Job failed: exit code 1
failed
robotpkg-py-eigenpy-py3-18.04-debug Test
| Fetched in submodule path 'cmake', but it did not contain 2d0d25008ebaba94ca76a428ac031466b5f3bb73. Direct fetching of that commit failed.
For details or bug reports, check the complete log file in:
/root/robotpkg/math/py-eigenpy/work.runner-ke6dzkhd-project-41-concurrent-0/extract.log

/root/robotpkg/mk/extract/checkout.mk:225: recipe for target 'do-checkout' failed
make: *** [do-checkout] Error 1
/root/robotpkg/mk/internal/trusted.mk:36: recipe for target 'checkout' failed
make: *** [checkout] Error 2
ERROR: Job failed: exit code 1
failed
robotpkg-py-eigenpy-16.04-release Test
| Unable to checkout '2d0d25008ebaba94ca76a428ac031466b5f3bb73' in submodule path 'cmake'

For details or bug reports, check the complete log file in:
/root/robotpkg/math/py-eigenpy/work.runner-swwlejyc-project-41-concurrent-0/extract.log
/root/robotpkg/mk/extract/checkout.mk:225: recipe for target 'do-checkout' failed
make: *** [do-checkout] Error 1
make: *** [checkout] Error 2
/root/robotpkg/mk/internal/trusted.mk:36: recipe for target 'checkout' failed
ERROR: Job failed: exit code 1
failed
robotpkg-py-eigenpy-py3-18.04-release Test
| Fetched in submodule path 'cmake', but it did not contain 2d0d25008ebaba94ca76a428ac031466b5f3bb73. Direct fetching of that commit failed.

For details or bug reports, check the complete log file in:
/root/robotpkg/math/py-eigenpy/work.runner-swwlejyc-project-41-concurrent-1/extract.log
make: *** [do-checkout] Error 1
/root/robotpkg/mk/extract/checkout.mk:225: recipe for target 'do-checkout' failed
/root/robotpkg/mk/internal/trusted.mk:36: recipe for target 'checkout' failed
make: *** [checkout] Error 2
ERROR: Job failed: exit code 1